Team Ai
Apppublic

KBaba7/llama.cpp

sourceHugging Faceapache-2.0updated 2y agoView on Hugging Face
0likes
CMakeConfigureLog.yaml805 linesDownload Raw Back to CMakeFiles
1 2---3events:4  -5    kind: "message-v1"6    backtrace:7      - "/opt/homebrew/share/cmake/Modules/CMakeDetermineSystem.cmake:205 (message)"8      - "CMakeLists.txt:2 (project)"9    message: |10      The system is: Darwin - 24.2.0 - arm6411  -12    kind: "message-v1"13    backtrace:14      - "/opt/homebrew/share/cmake/Modules/CMakeDetermineCompilerId.cmake:17 (message)"15      - "/opt/homebrew/share/cmake/Modules/CMakeDetermineCompilerId.cmake:64 (__determine_compiler_id_test)"16      - "/opt/homebrew/share/cmake/Modules/CMakeDetermineCCompiler.cmake:123 (CMAKE_DETERMINE_COMPILER_ID)"17      - "CMakeLists.txt:2 (project)"18    message: |19      Compiling the C compiler identification source file "CMakeCCompilerId.c" failed.20      Compiler: /Library/Developer/CommandLineTools/usr/bin/cc 21      Build flags: 22      Id flags:  23      24      The output was:25      126      ld: library 'System' not found27      cc: error: linker command failed with exit code 1 (use -v to see invocation)28      29      30  -31    kind: "message-v1"32    backtrace:33      - "/opt/homebrew/share/cmake/Modules/CMakeDetermineCompilerId.cmake:17 (message)"34      - "/opt/homebrew/share/cmake/Modules/CMakeDetermineCompilerId.cmake:64 (__determine_compiler_id_test)"35      - "/opt/homebrew/share/cmake/Modules/CMakeDetermineCCompiler.cmake:123 (CMAKE_DETERMINE_COMPILER_ID)"36      - "CMakeLists.txt:2 (project)"37    message: |38      Compiling the C compiler identification source file "CMakeCCompilerId.c" succeeded.39      Compiler: /Library/Developer/CommandLineTools/usr/bin/cc 40      Build flags: 41      Id flags: -c 42      43      The output was:44      045      46      47      Compilation of the C compiler identification source "CMakeCCompilerId.c" produced "CMakeCCompilerId.o"48      49      The C compiler identification is AppleClang, found in:50        /Users/kb7/Downloads/Quantization/llama.cpp/build/CMakeFiles/3.31.5/CompilerIdC/CMakeCCompilerId.o51      52  -53    kind: "message-v1"54    backtrace:55      - "/opt/homebrew/share/cmake/Modules/CMakeDetermineCompilerId.cmake:17 (message)"56      - "/opt/homebrew/share/cmake/Modules/CMakeDetermineCompilerId.cmake:64 (__determine_compiler_id_test)"57      - "/opt/homebrew/share/cmake/Modules/CMakeDetermineCXXCompiler.cmake:126 (CMAKE_DETERMINE_COMPILER_ID)"58      - "CMakeLists.txt:2 (project)"59    message: |60      Compiling the CXX compiler identification source file "CMakeCXXCompilerId.cpp" failed.61      Compiler: /Library/Developer/CommandLineTools/usr/bin/c++ 62      Build flags: 63      Id flags:  64      65      The output was:66      167      ld: library 'c++' not found68      c++: error: linker command failed with exit code 1 (use -v to see invocation)69      70      71  -72    kind: "message-v1"73    backtrace:74      - "/opt/homebrew/share/cmake/Modules/CMakeDetermineCompilerId.cmake:17 (message)"75      - "/opt/homebrew/share/cmake/Modules/CMakeDetermineCompilerId.cmake:64 (__determine_compiler_id_test)"76      - "/opt/homebrew/share/cmake/Modules/CMakeDetermineCXXCompiler.cmake:126 (CMAKE_DETERMINE_COMPILER_ID)"77      - "CMakeLists.txt:2 (project)"78    message: |79      Compiling the CXX compiler identification source file "CMakeCXXCompilerId.cpp" succeeded.80      Compiler: /Library/Developer/CommandLineTools/usr/bin/c++ 81      Build flags: 82      Id flags: -c 83      84      The output was:85      086      87      88      Compilation of the CXX compiler identification source "CMakeCXXCompilerId.cpp" produced "CMakeCXXCompilerId.o"89      90      The CXX compiler identification is AppleClang, found in:91        /Users/kb7/Downloads/Quantization/llama.cpp/build/CMakeFiles/3.31.5/CompilerIdCXX/CMakeCXXCompilerId.o92      93  -94    kind: "try_compile-v1"95    backtrace:96      - "/opt/homebrew/share/cmake/Modules/CMakeDetermineCompilerABI.cmake:74 (try_compile)"97      - "/opt/homebrew/share/cmake/Modules/CMakeTestCCompiler.cmake:26 (CMAKE_DETERMINE_COMPILER_ABI)"98      - "CMakeLists.txt:2 (project)"99    checks:100      - "Detecting C compiler ABI info"101    directories:102      source: "/Users/kb7/Downloads/Quantization/llama.cpp/build/CMakeFiles/CMakeScratch/TryCompile-T4mqGZ"103      binary: "/Users/kb7/Downloads/Quantization/llama.cpp/build/CMakeFiles/CMakeScratch/TryCompile-T4mqGZ"104    cmakeVariables:105      CMAKE_C_FLAGS: ""106      CMAKE_C_FLAGS_DEBUG: "-g"107      CMAKE_EXE_LINKER_FLAGS: ""108      CMAKE_OSX_ARCHITECTURES: ""109      CMAKE_OSX_DEPLOYMENT_TARGET: ""110      CMAKE_OSX_SYSROOT: "/Library/Developer/CommandLineTools/SDKs/MacOSX15.2.sdk"111    buildResult:112      variable: "CMAKE_C_ABI_COMPILED"113      cached: true114      stdout: |115        Change Dir: '/Users/kb7/Downloads/Quantization/llama.cpp/build/CMakeFiles/CMakeScratch/TryCompile-T4mqGZ'116        117        Run Build Command(s): /opt/homebrew/bin/cmake -E env VERBOSE=1 /usr/bin/make -f Makefile cmTC_60e58/fast118        /Library/Developer/CommandLineTools/usr/bin/make  -f CMakeFiles/cmTC_60e58.dir/build.make CMakeFiles/cmTC_60e58.dir/build119        Building C object CMakeFiles/cmTC_60e58.dir/CMakeCCompilerABI.c.o120        /Library/Developer/CommandLineTools/usr/bin/cc   -arch arm64 -isysroot /Library/Developer/CommandLineTools/SDKs/MacOSX15.2.sdk   -v -Wl,-v -MD -MT CMakeFiles/cmTC_60e58.dir/CMakeCCompilerABI.c.o -MF CMakeFiles/cmTC_60e58.dir/CMakeCCompilerABI.c.o.d -o CMakeFiles/cmTC_60e58.dir/CMakeCCompilerABI.c.o -c /opt/homebrew/share/cmake/Modules/CMakeCCompilerABI.c121        Apple clang version 16.0.0 (clang-1600.0.26.6)122        Target: arm64-apple-darwin24.2.0123        Thread model: posix124        InstalledDir: /Library/Developer/CommandLineTools/usr/bin125        cc: warning: -Wl,-v: 'linker' input unused [-Wunused-command-line-argument]126         "/Library/Developer/CommandLineTools/usr/bin/clang" -cc1 -triple arm64-apple-macosx15.0.0 -Wundef-prefix=TARGET_OS_ -Wdeprecated-objc-isa-usage -Werror=deprecated-objc-isa-usage -Werror=implicit-function-declaration -emit-obj -mrelax-all -disable-free -clear-ast-before-backend -disable-llvm-verifier -discard-value-names -main-file-name CMakeCCompilerABI.c -mrelocation-model pic -pic-level 2 -mframe-pointer=non-leaf -fno-strict-return -ffp-contract=on -fno-rounding-math -funwind-tables=1 -fobjc-msgsend-selector-stubs -target-sdk-version=15.2 -fvisibility-inlines-hidden-static-local-var -fno-modulemap-allow-subdirectory-search -target-cpu apple-m1 -target-feature +v8.5a -target-feature +aes -target-feature +crc -target-feature +dotprod -target-feature +fp-armv8 -target-feature +fp16fml -target-feature +lse -target-feature +ras -target-feature +rcpc -target-feature +rdm -target-feature +sha2 -target-feature +sha3 -target-feature +neon -target-feature +zcm -target-feature +zcz -target-feature +fullfp16 -target-abi darwinpcs -debugger-tuning=lldb -target-linker-version 1115.7.3 -v -fcoverage-compilation-dir=/Users/kb7/Downloads/Quantization/llama.cpp/build/CMakeFiles/CMakeScratch/TryCompile-T4mqGZ -resource-dir /Library/Developer/CommandLineTools/usr/lib/clang/16 -dependency-file CMakeFiles/cmTC_60e58.dir/CMakeCCompilerABI.c.o.d -skip-unused-modulemap-deps -MT CMakeFiles/cmTC_60e58.dir/CMakeCCompilerABI.c.o -sys-header-deps -isysroot /Library/Developer/CommandLineTools/SDKs/MacOSX15.2.sdk -internal-isystem /Library/Developer/CommandLineTools/SDKs/MacOSX15.2.sdk/usr/local/include -internal-isystem /Library/Developer/CommandLineTools/usr/lib/clang/16/include -internal-externc-isystem /Library/Developer/CommandLineTools/SDKs/MacOSX15.2.sdk/usr/include -internal-externc-isystem /Library/Developer/CommandLineTools/usr/include -Wno-reorder-init-list -Wno-implicit-int-float-conversion -Wno-c99-designator -Wno-final-dtor-non-final-class -Wno-extra-semi-stmt -Wno-misleading-indentation -Wno-quoted-include-in-framework-header -Wno-implicit-fallthrough -Wno-enum-enum-conversion -Wno-enum-float-conversion -Wno-elaborated-enum-base -Wno-reserved-identifier -Wno-gnu-folding-constant -fdebug-compilation-dir=/Users/kb7/Downloads/Quantization/llama.cpp/build/CMakeFiles/CMakeScratch/TryCompile-T4mqGZ -ferror-limit 19 -stack-protector 1 -fstack-check -mdarwin-stkchk-strong-link -fblocks -fencode-extended-block-signature -fregister-global-dtors-with-atexit -fgnuc-version=4.2.1 -fmax-type-align=16 -fcommon -clang-vendor-feature=+disableNonDependentMemberExprInCurrentInstantiation -fno-odr-hash-protocols -clang-vendor-feature=+enableAggressiveVLAFolding -clang-vendor-feature=+revert09abecef7bbf -clang-vendor-feature=+thisNoAlignAttr -clang-vendor-feature=+thisNoNullAttr -clang-vendor-feature=+disableAtImportPrivateFrameworkInImplementationError -D__GCC_HAVE_DWARF2_CFI_ASM=1 -o CMakeFiles/cmTC_60e58.dir/CMakeCCompilerABI.c.o -x c /opt/homebrew/share/cmake/Modules/CMakeCCompilerABI.c127        clang -cc1 version 16.0.0 (clang-1600.0.26.6) default target arm64-apple-darwin24.2.0128        ignoring nonexistent directory "/Library/Developer/CommandLineTools/SDKs/MacOSX15.2.sdk/usr/local/include"129        ignoring nonexistent directory "/Library/Developer/CommandLineTools/SDKs/MacOSX15.2.sdk/Library/Frameworks"130        #include "..." search starts here:131        #include <...> search starts here:132         /Library/Developer/CommandLineTools/usr/lib/clang/16/include133         /Library/Developer/CommandLineTools/SDKs/MacOSX15.2.sdk/usr/include134         /Library/Developer/CommandLineTools/usr/include135         /Library/Developer/CommandLineTools/SDKs/MacOSX15.2.sdk/System/Library/Frameworks (framework directory)136        End of search list.137        Linking C executable cmTC_60e58138        /opt/homebrew/bin/cmake -E cmake_link_script CMakeFiles/cmTC_60e58.dir/link.txt --verbose=1139        Apple clang version 16.0.0 (clang-1600.0.26.6)140        Target: arm64-apple-darwin24.2.0141        Thread model: posix142        InstalledDir: /Library/Developer/CommandLineTools/usr/bin143         "/Library/Developer/CommandLineTools/usr/bin/ld" -demangle -lto_library /Library/Developer/CommandLineTools/usr/lib/libLTO.dylib -dynamic -arch arm64 -platform_version macos 15.0.0 15.2 -syslibroot /Library/Developer/CommandLineTools/SDKs/MacOSX15.2.sdk -mllvm -enable-linkonceodr-outlining -o cmTC_60e58 -search_paths_first -headerpad_max_install_names -v CMakeFiles/cmTC_60e58.dir/CMakeCCompilerABI.c.o -lSystem /Library/Developer/CommandLineTools/usr/lib/clang/16/lib/darwin/libclang_rt.osx.a144        @(#)PROGRAM:ld PROJECT:ld-1115.7.3145        BUILD 23:52:02 Dec  5 2024146        configured to support archs: armv6 armv7 armv7s arm64 arm64e arm64_32 i386 x86_64 x86_64h armv6m armv7k armv7m armv7em147        will use ld-classic for: armv6 armv7 armv7s i386 armv6m armv7k armv7m armv7em148        LTO support using: LLVM version 16.0.0 (static support for 29, runtime is 29)149        TAPI support using: Apple TAPI version 16.0.0 (tapi-1600.0.11.9)150        Library search paths:151        	/Library/Developer/CommandLineTools/SDKs/MacOSX15.2.sdk/usr/lib152        	/Library/Developer/CommandLineTools/SDKs/MacOSX15.2.sdk/usr/lib/swift153        Framework search paths:154        	/Library/Developer/CommandLineTools/SDKs/MacOSX15.2.sdk/System/Library/Frameworks155        /Library/Developer/CommandLineTools/usr/bin/cc  -arch arm64 -isysroot /Library/Developer/CommandLineTools/SDKs/MacOSX15.2.sdk -Wl,-search_paths_first -Wl,-headerpad_max_install_names  -v -Wl,-v CMakeFiles/cmTC_60e58.dir/CMakeCCompilerABI.c.o -o cmTC_60e58156        157      exitCode: 0158  -159    kind: "message-v1"160    backtrace:161      - "/opt/homebrew/share/cmake/Modules/CMakeDetermineCompilerABI.cmake:113 (message)"162      - "/opt/homebrew/share/cmake/Modules/CMakeTestCCompiler.cmake:26 (CMAKE_DETERMINE_COMPILER_ABI)"163      - "CMakeLists.txt:2 (project)"164    message: |165      Effective list of requested architectures (possibly empty)  : ""166      Effective list of architectures found in the ABI info binary: "arm64"167  -168    kind: "message-v1"169    backtrace:170      - "/opt/homebrew/share/cmake/Modules/CMakeDetermineCompilerABI.cmake:182 (message)"171      - "/opt/homebrew/share/cmake/Modules/CMakeTestCCompiler.cmake:26 (CMAKE_DETERMINE_COMPILER_ABI)"172      - "CMakeLists.txt:2 (project)"173    message: |174      Parsed C implicit include dir info: rv=done175        found start of include info176        found start of implicit include info177          add: [/Library/Developer/CommandLineTools/usr/lib/clang/16/include]178          add: [/Library/Developer/CommandLineTools/SDKs/MacOSX15.2.sdk/usr/include]179          add: [/Library/Developer/CommandLineTools/usr/include]180        end of search list found181        collapse include dir [/Library/Developer/CommandLineTools/usr/lib/clang/16/include] ==> [/Library/Developer/CommandLineTools/usr/lib/clang/16/include]182        collapse include dir [/Library/Developer/CommandLineTools/SDKs/MacOSX15.2.sdk/usr/include] ==> [/Library/Developer/CommandLineTools/SDKs/MacOSX15.2.sdk/usr/include]183        collapse include dir [/Library/Developer/CommandLineTools/usr/include] ==> [/Library/Developer/CommandLineTools/usr/include]184        implicit include dirs: [/Library/Developer/CommandLineTools/usr/lib/clang/16/include;/Library/Developer/CommandLineTools/SDKs/MacOSX15.2.sdk/usr/include;/Library/Developer/CommandLineTools/usr/include]185      186      187  -188    kind: "message-v1"189    backtrace:190      - "/opt/homebrew/share/cmake/Modules/CMakeDetermineCompilerABI.cmake:218 (message)"191      - "/opt/homebrew/share/cmake/Modules/CMakeTestCCompiler.cmake:26 (CMAKE_DETERMINE_COMPILER_ABI)"192      - "CMakeLists.txt:2 (project)"193    message: |194      Parsed C implicit link information:195        link line regex: [^( *|.*[/\\])(ld[0-9]*(\\.[a-z]+)?|CMAKE_LINK_STARTFILE-NOTFOUND|([^/\\]+-)?ld|collect2)[^/\\]*( |$)]196        linker tool regex: [^[ 	]*(->|")?[ 	]*(([^"]*[/\\])?(ld[0-9]*(\\.[a-z]+)?))("|,| |$)]197        ignore line: [Change Dir: '/Users/kb7/Downloads/Quantization/llama.cpp/build/CMakeFiles/CMakeScratch/TryCompile-T4mqGZ']198        ignore line: []199        ignore line: [Run Build Command(s): /opt/homebrew/bin/cmake -E env VERBOSE=1 /usr/bin/make -f Makefile cmTC_60e58/fast]200        ignore line: [/Library/Developer/CommandLineTools/usr/bin/make  -f CMakeFiles/cmTC_60e58.dir/build.make CMakeFiles/cmTC_60e58.dir/build]201        ignore line: [Building C object CMakeFiles/cmTC_60e58.dir/CMakeCCompilerABI.c.o]202        ignore line: [/Library/Developer/CommandLineTools/usr/bin/cc   -arch arm64 -isysroot /Library/Developer/CommandLineTools/SDKs/MacOSX15.2.sdk   -v -Wl -v -MD -MT CMakeFiles/cmTC_60e58.dir/CMakeCCompilerABI.c.o -MF CMakeFiles/cmTC_60e58.dir/CMakeCCompilerABI.c.o.d -o CMakeFiles/cmTC_60e58.dir/CMakeCCompilerABI.c.o -c /opt/homebrew/share/cmake/Modules/CMakeCCompilerABI.c]203        ignore line: [Apple clang version 16.0.0 (clang-1600.0.26.6)]204        ignore line: [Target: arm64-apple-darwin24.2.0]205        ignore line: [Thread model: posix]206        ignore line: [InstalledDir: /Library/Developer/CommandLineTools/usr/bin]207        ignore line: [cc: warning: -Wl -v: 'linker' input unused [-Wunused-command-line-argument]]208        ignore line: [ "/Library/Developer/CommandLineTools/usr/bin/clang" -cc1 -triple arm64-apple-macosx15.0.0 -Wundef-prefix=TARGET_OS_ -Wdeprecated-objc-isa-usage -Werror=deprecated-objc-isa-usage -Werror=implicit-function-declaration -emit-obj -mrelax-all -disable-free -clear-ast-before-backend -disable-llvm-verifier -discard-value-names -main-file-name CMakeCCompilerABI.c -mrelocation-model pic -pic-level 2 -mframe-pointer=non-leaf -fno-strict-return -ffp-contract=on -fno-rounding-math -funwind-tables=1 -fobjc-msgsend-selector-stubs -target-sdk-version=15.2 -fvisibility-inlines-hidden-static-local-var -fno-modulemap-allow-subdirectory-search -target-cpu apple-m1 -target-feature +v8.5a -target-feature +aes -target-feature +crc -target-feature +dotprod -target-feature +fp-armv8 -target-feature +fp16fml -target-feature +lse -target-feature +ras -target-feature +rcpc -target-feature +rdm -target-feature +sha2 -target-feature +sha3 -target-feature +neon -target-feature +zcm -target-feature +zcz -target-feature +fullfp16 -target-abi darwinpcs -debugger-tuning=lldb -target-linker-version 1115.7.3 -v -fcoverage-compilation-dir=/Users/kb7/Downloads/Quantization/llama.cpp/build/CMakeFiles/CMakeScratch/TryCompile-T4mqGZ -resource-dir /Library/Developer/CommandLineTools/usr/lib/clang/16 -dependency-file CMakeFiles/cmTC_60e58.dir/CMakeCCompilerABI.c.o.d -skip-unused-modulemap-deps -MT CMakeFiles/cmTC_60e58.dir/CMakeCCompilerABI.c.o -sys-header-deps -isysroot /Library/Developer/CommandLineTools/SDKs/MacOSX15.2.sdk -internal-isystem /Library/Developer/CommandLineTools/SDKs/MacOSX15.2.sdk/usr/local/include -internal-isystem /Library/Developer/CommandLineTools/usr/lib/clang/16/include -internal-externc-isystem /Library/Developer/CommandLineTools/SDKs/MacOSX15.2.sdk/usr/include -internal-externc-isystem /Library/Developer/CommandLineTools/usr/include -Wno-reorder-init-list -Wno-implicit-int-float-conversion -Wno-c99-designator -Wno-final-dtor-non-final-class -Wno-extra-semi-stmt -Wno-misleading-indentation -Wno-quoted-include-in-framework-header -Wno-implicit-fallthrough -Wno-enum-enum-conversion -Wno-enum-float-conversion -Wno-elaborated-enum-base -Wno-reserved-identifier -Wno-gnu-folding-constant -fdebug-compilation-dir=/Users/kb7/Downloads/Quantization/llama.cpp/build/CMakeFiles/CMakeScratch/TryCompile-T4mqGZ -ferror-limit 19 -stack-protector 1 -fstack-check -mdarwin-stkchk-strong-link -fblocks -fencode-extended-block-signature -fregister-global-dtors-with-atexit -fgnuc-version=4.2.1 -fmax-type-align=16 -fcommon -clang-vendor-feature=+disableNonDependentMemberExprInCurrentInstantiation -fno-odr-hash-protocols -clang-vendor-feature=+enableAggressiveVLAFolding -clang-vendor-feature=+revert09abecef7bbf -clang-vendor-feature=+thisNoAlignAttr -clang-vendor-feature=+thisNoNullAttr -clang-vendor-feature=+disableAtImportPrivateFrameworkInImplementationError -D__GCC_HAVE_DWARF2_CFI_ASM=1 -o CMakeFiles/cmTC_60e58.dir/CMakeCCompilerABI.c.o -x c /opt/homebrew/share/cmake/Modules/CMakeCCompilerABI.c]209        ignore line: [clang -cc1 version 16.0.0 (clang-1600.0.26.6) default target arm64-apple-darwin24.2.0]210        ignore line: [ignoring nonexistent directory "/Library/Developer/CommandLineTools/SDKs/MacOSX15.2.sdk/usr/local/include"]211        ignore line: [ignoring nonexistent directory "/Library/Developer/CommandLineTools/SDKs/MacOSX15.2.sdk/Library/Frameworks"]212        ignore line: [#include "..." search starts here:]213        ignore line: [#include <...> search starts here:]214        ignore line: [ /Library/Developer/CommandLineTools/usr/lib/clang/16/include]215        ignore line: [ /Library/Developer/CommandLineTools/SDKs/MacOSX15.2.sdk/usr/include]216        ignore line: [ /Library/Developer/CommandLineTools/usr/include]217        ignore line: [ /Library/Developer/CommandLineTools/SDKs/MacOSX15.2.sdk/System/Library/Frameworks (framework directory)]218        ignore line: [End of search list.]219        ignore line: [Linking C executable cmTC_60e58]220        ignore line: [/opt/homebrew/bin/cmake -E cmake_link_script CMakeFiles/cmTC_60e58.dir/link.txt --verbose=1]221        ignore line: [Apple clang version 16.0.0 (clang-1600.0.26.6)]222        ignore line: [Target: arm64-apple-darwin24.2.0]223        ignore line: [Thread model: posix]224        ignore line: [InstalledDir: /Library/Developer/CommandLineTools/usr/bin]225        link line: [ "/Library/Developer/CommandLineTools/usr/bin/ld" -demangle -lto_library /Library/Developer/CommandLineTools/usr/lib/libLTO.dylib -dynamic -arch arm64 -platform_version macos 15.0.0 15.2 -syslibroot /Library/Developer/CommandLineTools/SDKs/MacOSX15.2.sdk -mllvm -enable-linkonceodr-outlining -o cmTC_60e58 -search_paths_first -headerpad_max_install_names -v CMakeFiles/cmTC_60e58.dir/CMakeCCompilerABI.c.o -lSystem /Library/Developer/CommandLineTools/usr/lib/clang/16/lib/darwin/libclang_rt.osx.a]226          arg [/Library/Developer/CommandLineTools/usr/bin/ld] ==> ignore227          arg [-demangle] ==> ignore228          arg [-lto_library] ==> ignore, skip following value229          arg [/Library/Developer/CommandLineTools/usr/lib/libLTO.dylib] ==> skip value of -lto_library230          arg [-dynamic] ==> ignore231          arg [-arch] ==> ignore232          arg [arm64] ==> ignore233          arg [-platform_version] ==> ignore234          arg [macos] ==> ignore235          arg [15.0.0] ==> ignore236          arg [15.2] ==> ignore237          arg [-syslibroot] ==> ignore238          arg [/Library/Developer/CommandLineTools/SDKs/MacOSX15.2.sdk] ==> ignore239          arg [-mllvm] ==> ignore240          arg [-enable-linkonceodr-outlining] ==> ignore241          arg [-o] ==> ignore242          arg [cmTC_60e58] ==> ignore243          arg [-search_paths_first] ==> ignore244          arg [-headerpad_max_install_names] ==> ignore245          arg [-v] ==> ignore246          arg [CMakeFiles/cmTC_60e58.dir/CMakeCCompilerABI.c.o] ==> ignore247          arg [-lSystem] ==> lib [System]248          arg [/Library/Developer/CommandLineTools/usr/lib/clang/16/lib/darwin/libclang_rt.osx.a] ==> lib [/Library/Developer/CommandLineTools/usr/lib/clang/16/lib/darwin/libclang_rt.osx.a]249        linker tool for 'C': /Library/Developer/CommandLineTools/usr/bin/ld250        Library search paths: [;/Library/Developer/CommandLineTools/SDKs/MacOSX15.2.sdk/usr/lib;/Library/Developer/CommandLineTools/SDKs/MacOSX15.2.sdk/usr/lib/swift]251        Framework search paths: [;/Library/Developer/CommandLineTools/SDKs/MacOSX15.2.sdk/System/Library/Frameworks]252        remove lib [System]253        remove lib [/Library/Developer/CommandLineTools/usr/lib/clang/16/lib/darwin/libclang_rt.osx.a]254        collapse library dir [/Library/Developer/CommandLineTools/SDKs/MacOSX15.2.sdk/usr/lib] ==> [/Library/Developer/CommandLineTools/SDKs/MacOSX15.2.sdk/usr/lib]255        collapse library dir [/Library/Developer/CommandLineTools/SDKs/MacOSX15.2.sdk/usr/lib/swift] ==> [/Library/Developer/CommandLineTools/SDKs/MacOSX15.2.sdk/usr/lib/swift]256        collapse framework dir [/Library/Developer/CommandLineTools/SDKs/MacOSX15.2.sdk/System/Library/Frameworks] ==> [/Library/Developer/CommandLineTools/SDKs/MacOSX15.2.sdk/System/Library/Frameworks]257        implicit libs: []258        implicit objs: []259        implicit dirs: [/Library/Developer/CommandLineTools/SDKs/MacOSX15.2.sdk/usr/lib;/Library/Developer/CommandLineTools/SDKs/MacOSX15.2.sdk/usr/lib/swift]260        implicit fwks: [/Library/Developer/CommandLineTools/SDKs/MacOSX15.2.sdk/System/Library/Frameworks]261      262      263  -264    kind: "message-v1"265    backtrace:266      - "/opt/homebrew/share/cmake/Modules/Internal/CMakeDetermineLinkerId.cmake:40 (message)"267      - "/opt/homebrew/share/cmake/Modules/CMakeDetermineCompilerABI.cmake:255 (cmake_determine_linker_id)"268      - "/opt/homebrew/share/cmake/Modules/CMakeTestCCompiler.cmake:26 (CMAKE_DETERMINE_COMPILER_ABI)"269      - "CMakeLists.txt:2 (project)"270    message: |271      Running the C compiler's linker: "/Library/Developer/CommandLineTools/usr/bin/ld" "-v"272      @(#)PROGRAM:ld PROJECT:ld-1115.7.3273      BUILD 23:52:02 Dec  5 2024274      configured to support archs: armv6 armv7 armv7s arm64 arm64e arm64_32 i386 x86_64 x86_64h armv6m armv7k armv7m armv7em275      will use ld-classic for: armv6 armv7 armv7s i386 armv6m armv7k armv7m armv7em276      LTO support using: LLVM version 16.0.0 (static support for 29, runtime is 29)277      TAPI support using: Apple TAPI version 16.0.0 (tapi-1600.0.11.9)278  -279    kind: "try_compile-v1"280    backtrace:281      - "/opt/homebrew/share/cmake/Modules/CMakeDetermineCompilerABI.cmake:74 (try_compile)"282      - "/opt/homebrew/share/cmake/Modules/CMakeTestCXXCompiler.cmake:26 (CMAKE_DETERMINE_COMPILER_ABI)"283      - "CMakeLists.txt:2 (project)"284    checks:285      - "Detecting CXX compiler ABI info"286    directories:287      source: "/Users/kb7/Downloads/Quantization/llama.cpp/build/CMakeFiles/CMakeScratch/TryCompile-QVtX2E"288      binary: "/Users/kb7/Downloads/Quantization/llama.cpp/build/CMakeFiles/CMakeScratch/TryCompile-QVtX2E"289    cmakeVariables:290      CMAKE_CXX_FLAGS: ""291      CMAKE_CXX_FLAGS_DEBUG: "-g"292      CMAKE_CXX_SCAN_FOR_MODULES: "OFF"293      CMAKE_EXE_LINKER_FLAGS: ""294      CMAKE_OSX_ARCHITECTURES: ""295      CMAKE_OSX_DEPLOYMENT_TARGET: ""296      CMAKE_OSX_SYSROOT: "/Library/Developer/CommandLineTools/SDKs/MacOSX15.2.sdk"297    buildResult:298      variable: "CMAKE_CXX_ABI_COMPILED"299      cached: true300      stdout: |301        Change Dir: '/Users/kb7/Downloads/Quantization/llama.cpp/build/CMakeFiles/CMakeScratch/TryCompile-QVtX2E'302        303        Run Build Command(s): /opt/homebrew/bin/cmake -E env VERBOSE=1 /usr/bin/make -f Makefile cmTC_e7565/fast304        /Library/Developer/CommandLineTools/usr/bin/make  -f CMakeFiles/cmTC_e7565.dir/build.make CMakeFiles/cmTC_e7565.dir/build305        Building CXX object CMakeFiles/cmTC_e7565.dir/CMakeCXXCompilerABI.cpp.o306        /Library/Developer/CommandLineTools/usr/bin/c++   -arch arm64 -isysroot /Library/Developer/CommandLineTools/SDKs/MacOSX15.2.sdk   -v -Wl,-v -MD -MT CMakeFiles/cmTC_e7565.dir/CMakeCXXCompilerABI.cpp.o -MF CMakeFiles/cmTC_e7565.dir/CMakeCXXCompilerABI.cpp.o.d -o CMakeFiles/cmTC_e7565.dir/CMakeCXXCompilerABI.cpp.o -c /opt/homebrew/share/cmake/Modules/CMakeCXXCompilerABI.cpp307        Apple clang version 16.0.0 (clang-1600.0.26.6)308        Target: arm64-apple-darwin24.2.0309        Thread model: posix310        InstalledDir: /Library/Developer/CommandLineTools/usr/bin311        c++: warning: -Wl,-v: 'linker' input unused [-Wunused-command-line-argument]312        ignoring nonexistent directory "/Library/Developer/CommandLineTools/usr/bin/../include/c++/v1"313         "/Library/Developer/CommandLineTools/usr/bin/clang" -cc1 -triple arm64-apple-macosx15.0.0 -Wundef-prefix=TARGET_OS_ -Wdeprecated-objc-isa-usage -Werror=deprecated-objc-isa-usage -Werror=implicit-function-declaration -emit-obj -mrelax-all -disable-free -clear-ast-before-backend -disable-llvm-verifier -discard-value-names -main-file-name CMakeCXXCompilerABI.cpp -mrelocation-model pic -pic-level 2 -mframe-pointer=non-leaf -fno-strict-return -ffp-contract=on -fno-rounding-math -funwind-tables=1 -fobjc-msgsend-selector-stubs -target-sdk-version=15.2 -fvisibility-inlines-hidden-static-local-var -fno-modulemap-allow-subdirectory-search -target-cpu apple-m1 -target-feature +v8.5a -target-feature +aes -target-feature +crc -target-feature +dotprod -target-feature +fp-armv8 -target-feature +fp16fml -target-feature +lse -target-feature +ras -target-feature +rcpc -target-feature +rdm -target-feature +sha2 -target-feature +sha3 -target-feature +neon -target-feature +zcm -target-feature +zcz -target-feature +fullfp16 -target-abi darwinpcs -debugger-tuning=lldb -target-linker-version 1115.7.3 -v -fcoverage-compilation-dir=/Users/kb7/Downloads/Quantization/llama.cpp/build/CMakeFiles/CMakeScratch/TryCompile-QVtX2E -resource-dir /Library/Developer/CommandLineTools/usr/lib/clang/16 -dependency-file CMakeFiles/cmTC_e7565.dir/CMakeCXXCompilerABI.cpp.o.d -skip-unused-modulemap-deps -MT CMakeFiles/cmTC_e7565.dir/CMakeCXXCompilerABI.cpp.o -sys-header-deps -isysroot /Library/Developer/CommandLineTools/SDKs/MacOSX15.2.sdk -internal-isystem /Library/Developer/CommandLineTools/SDKs/MacOSX15.2.sdk/usr/include/c++/v1 -internal-isystem /Library/Developer/CommandLineTools/SDKs/MacOSX15.2.sdk/usr/local/include -internal-isystem /Library/Developer/CommandLineTools/usr/lib/clang/16/include -internal-externc-isystem /Library/Developer/CommandLineTools/SDKs/MacOSX15.2.sdk/usr/include -internal-externc-isystem /Library/Developer/CommandLineTools/usr/include -Wno-reorder-init-list -Wno-implicit-int-float-conversion -Wno-c99-designator -Wno-final-dtor-non-final-class -Wno-extra-semi-stmt -Wno-misleading-indentation -Wno-quoted-include-in-framework-header -Wno-implicit-fallthrough -Wno-enum-enum-conversion -Wno-enum-float-conversion -Wno-elaborated-enum-base -Wno-reserved-identifier -Wno-gnu-folding-constant -fdeprecated-macro -fdebug-compilation-dir=/Users/kb7/Downloads/Quantization/llama.cpp/build/CMakeFiles/CMakeScratch/TryCompile-QVtX2E -ferror-limit 19 -stack-protector 1 -fstack-check -mdarwin-stkchk-strong-link -fblocks -fencode-extended-block-signature -fregister-global-dtors-with-atexit -fgnuc-version=4.2.1 -fno-cxx-modules -fcxx-exceptions -fexceptions -fmax-type-align=16 -fcommon -clang-vendor-feature=+disableNonDependentMemberExprInCurrentInstantiation -fno-odr-hash-protocols -clang-vendor-feature=+enableAggressiveVLAFolding -clang-vendor-feature=+revert09abecef7bbf -clang-vendor-feature=+thisNoAlignAttr -clang-vendor-feature=+thisNoNullAttr -clang-vendor-feature=+disableAtImportPrivateFrameworkInImplementationError -D__GCC_HAVE_DWARF2_CFI_ASM=1 -o CMakeFiles/cmTC_e7565.dir/CMakeCXXCompilerABI.cpp.o -x c++ /opt/homebrew/share/cmake/Modules/CMakeCXXCompilerABI.cpp314        clang -cc1 version 16.0.0 (clang-1600.0.26.6) default target arm64-apple-darwin24.2.0315        ignoring nonexistent directory "/Library/Developer/CommandLineTools/SDKs/MacOSX15.2.sdk/usr/local/include"316        ignoring nonexistent directory "/Library/Developer/CommandLineTools/SDKs/MacOSX15.2.sdk/Library/Frameworks"317        #include "..." search starts here:318        #include <...> search starts here:319         /Library/Developer/CommandLineTools/SDKs/MacOSX15.2.sdk/usr/include/c++/v1320         /Library/Developer/CommandLineTools/usr/lib/clang/16/include321         /Library/Developer/CommandLineTools/SDKs/MacOSX15.2.sdk/usr/include322         /Library/Developer/CommandLineTools/usr/include323         /Library/Developer/CommandLineTools/SDKs/MacOSX15.2.sdk/System/Library/Frameworks (framework directory)324        End of search list.325        Linking CXX executable cmTC_e7565326        /opt/homebrew/bin/cmake -E cmake_link_script CMakeFiles/cmTC_e7565.dir/link.txt --verbose=1327        Apple clang version 16.0.0 (clang-1600.0.26.6)328        Target: arm64-apple-darwin24.2.0329        Thread model: posix330        InstalledDir: /Library/Developer/CommandLineTools/usr/bin331         "/Library/Developer/CommandLineTools/usr/bin/ld" -demangle -lto_library /Library/Developer/CommandLineTools/usr/lib/libLTO.dylib -dynamic -arch arm64 -platform_version macos 15.0.0 15.2 -syslibroot /Library/Developer/CommandLineTools/SDKs/MacOSX15.2.sdk -mllvm -enable-linkonceodr-outlining -o cmTC_e7565 -search_paths_first -headerpad_max_install_names -v CMakeFiles/cmTC_e7565.dir/CMakeCXXCompilerABI.cpp.o -lc++ -lSystem /Library/Developer/CommandLineTools/usr/lib/clang/16/lib/darwin/libclang_rt.osx.a332        @(#)PROGRAM:ld PROJECT:ld-1115.7.3333        BUILD 23:52:02 Dec  5 2024334        configured to support archs: armv6 armv7 armv7s arm64 arm64e arm64_32 i386 x86_64 x86_64h armv6m armv7k armv7m armv7em335        will use ld-classic for: armv6 armv7 armv7s i386 armv6m armv7k armv7m armv7em336        LTO support using: LLVM version 16.0.0 (static support for 29, runtime is 29)337        TAPI support using: Apple TAPI version 16.0.0 (tapi-1600.0.11.9)338        Library search paths:339        	/Library/Developer/CommandLineTools/SDKs/MacOSX15.2.sdk/usr/lib340        	/Library/Developer/CommandLineTools/SDKs/MacOSX15.2.sdk/usr/lib/swift341        Framework search paths:342        	/Library/Developer/CommandLineTools/SDKs/MacOSX15.2.sdk/System/Library/Frameworks343        /Library/Developer/CommandLineTools/usr/bin/c++  -arch arm64 -isysroot /Library/Developer/CommandLineTools/SDKs/MacOSX15.2.sdk -Wl,-search_paths_first -Wl,-headerpad_max_install_names  -v -Wl,-v CMakeFiles/cmTC_e7565.dir/CMakeCXXCompilerABI.cpp.o -o cmTC_e7565344        345      exitCode: 0346  -347    kind: "message-v1"348    backtrace:349      - "/opt/homebrew/share/cmake/Modules/CMakeDetermineCompilerABI.cmake:113 (message)"350      - "/opt/homebrew/share/cmake/Modules/CMakeTestCXXCompiler.cmake:26 (CMAKE_DETERMINE_COMPILER_ABI)"351      - "CMakeLists.txt:2 (project)"352    message: |353      Effective list of requested architectures (possibly empty)  : ""354      Effective list of architectures found in the ABI info binary: "arm64"355  -356    kind: "message-v1"357    backtrace:358      - "/opt/homebrew/share/cmake/Modules/CMakeDetermineCompilerABI.cmake:182 (message)"359      - "/opt/homebrew/share/cmake/Modules/CMakeTestCXXCompiler.cmake:26 (CMAKE_DETERMINE_COMPILER_ABI)"360      - "CMakeLists.txt:2 (project)"361    message: |362      Parsed CXX implicit include dir info: rv=done363        found start of include info364        found start of implicit include info365          add: [/Library/Developer/CommandLineTools/SDKs/MacOSX15.2.sdk/usr/include/c++/v1]366          add: [/Library/Developer/CommandLineTools/usr/lib/clang/16/include]367          add: [/Library/Developer/CommandLineTools/SDKs/MacOSX15.2.sdk/usr/include]368          add: [/Library/Developer/CommandLineTools/usr/include]369        end of search list found370        collapse include dir [/Library/Developer/CommandLineTools/SDKs/MacOSX15.2.sdk/usr/include/c++/v1] ==> [/Library/Developer/CommandLineTools/SDKs/MacOSX15.2.sdk/usr/include/c++/v1]371        collapse include dir [/Library/Developer/CommandLineTools/usr/lib/clang/16/include] ==> [/Library/Developer/CommandLineTools/usr/lib/clang/16/include]372        collapse include dir [/Library/Developer/CommandLineTools/SDKs/MacOSX15.2.sdk/usr/include] ==> [/Library/Developer/CommandLineTools/SDKs/MacOSX15.2.sdk/usr/include]373        collapse include dir [/Library/Developer/CommandLineTools/usr/include] ==> [/Library/Developer/CommandLineTools/usr/include]374        implicit include dirs: [/Library/Developer/CommandLineTools/SDKs/MacOSX15.2.sdk/usr/include/c++/v1;/Library/Developer/CommandLineTools/usr/lib/clang/16/include;/Library/Developer/CommandLineTools/SDKs/MacOSX15.2.sdk/usr/include;/Library/Developer/CommandLineTools/usr/include]375      376      377  -378    kind: "message-v1"379    backtrace:380      - "/opt/homebrew/share/cmake/Modules/CMakeDetermineCompilerABI.cmake:218 (message)"381      - "/opt/homebrew/share/cmake/Modules/CMakeTestCXXCompiler.cmake:26 (CMAKE_DETERMINE_COMPILER_ABI)"382      - "CMakeLists.txt:2 (project)"383    message: |384      Parsed CXX implicit link information:385        link line regex: [^( *|.*[/\\])(ld[0-9]*(\\.[a-z]+)?|CMAKE_LINK_STARTFILE-NOTFOUND|([^/\\]+-)?ld|collect2)[^/\\]*( |$)]386        linker tool regex: [^[ 	]*(->|")?[ 	]*(([^"]*[/\\])?(ld[0-9]*(\\.[a-z]+)?))("|,| |$)]387        ignore line: [Change Dir: '/Users/kb7/Downloads/Quantization/llama.cpp/build/CMakeFiles/CMakeScratch/TryCompile-QVtX2E']388        ignore line: []389        ignore line: [Run Build Command(s): /opt/homebrew/bin/cmake -E env VERBOSE=1 /usr/bin/make -f Makefile cmTC_e7565/fast]390        ignore line: [/Library/Developer/CommandLineTools/usr/bin/make  -f CMakeFiles/cmTC_e7565.dir/build.make CMakeFiles/cmTC_e7565.dir/build]391        ignore line: [Building CXX object CMakeFiles/cmTC_e7565.dir/CMakeCXXCompilerABI.cpp.o]392        ignore line: [/Library/Developer/CommandLineTools/usr/bin/c++   -arch arm64 -isysroot /Library/Developer/CommandLineTools/SDKs/MacOSX15.2.sdk   -v -Wl -v -MD -MT CMakeFiles/cmTC_e7565.dir/CMakeCXXCompilerABI.cpp.o -MF CMakeFiles/cmTC_e7565.dir/CMakeCXXCompilerABI.cpp.o.d -o CMakeFiles/cmTC_e7565.dir/CMakeCXXCompilerABI.cpp.o -c /opt/homebrew/share/cmake/Modules/CMakeCXXCompilerABI.cpp]393        ignore line: [Apple clang version 16.0.0 (clang-1600.0.26.6)]394        ignore line: [Target: arm64-apple-darwin24.2.0]395        ignore line: [Thread model: posix]396        ignore line: [InstalledDir: /Library/Developer/CommandLineTools/usr/bin]397        ignore line: [c++: warning: -Wl -v: 'linker' input unused [-Wunused-command-line-argument]]398        ignore line: [ignoring nonexistent directory "/Library/Developer/CommandLineTools/usr/bin/../include/c++/v1"]399        ignore line: [ "/Library/Developer/CommandLineTools/usr/bin/clang" -cc1 -triple arm64-apple-macosx15.0.0 -Wundef-prefix=TARGET_OS_ -Wdeprecated-objc-isa-usage -Werror=deprecated-objc-isa-usage -Werror=implicit-function-declaration -emit-obj -mrelax-all -disable-free -clear-ast-before-backend -disable-llvm-verifier -discard-value-names -main-file-name CMakeCXXCompilerABI.cpp -mrelocation-model pic -pic-level 2 -mframe-pointer=non-leaf -fno-strict-return -ffp-contract=on -fno-rounding-math -funwind-tables=1 -fobjc-msgsend-selector-stubs -target-sdk-version=15.2 -fvisibility-inlines-hidden-static-local-var -fno-modulemap-allow-subdirectory-search -target-cpu apple-m1 -target-feature +v8.5a -target-feature +aes -target-feature +crc -target-feature +dotprod -target-feature +fp-armv8 -target-feature +fp16fml -target-feature +lse -target-feature +ras -target-feature +rcpc -target-feature +rdm -target-feature +sha2 -target-feature +sha3 -target-feature +neon -target-feature +zcm -target-feature +zcz -target-feature +fullfp16 -target-abi darwinpcs -debugger-tuning=lldb -target-linker-version 1115.7.3 -v -fcoverage-compilation-dir=/Users/kb7/Downloads/Quantization/llama.cpp/build/CMakeFiles/CMakeScratch/TryCompile-QVtX2E -resource-dir /Library/Developer/CommandLineTools/usr/lib/clang/16 -dependency-file CMakeFiles/cmTC_e7565.dir/CMakeCXXCompilerABI.cpp.o.d -skip-unused-modulemap-deps -MT CMakeFiles/cmTC_e7565.dir/CMakeCXXCompilerABI.cpp.o -sys-header-deps -isysroot /Library/Developer/CommandLineTools/SDKs/MacOSX15.2.sdk -internal-isystem /Library/Developer/CommandLineTools/SDKs/MacOSX15.2.sdk/usr/include/c++/v1 -internal-isystem /Library/Developer/CommandLineTools/SDKs/MacOSX15.2.sdk/usr/local/include -internal-isystem /Library/Developer/CommandLineTools/usr/lib/clang/16/include -internal-externc-isystem /Library/Developer/CommandLineTools/SDKs/MacOSX15.2.sdk/usr/include -internal-externc-isystem /Library/Developer/CommandLineTools/usr/include -Wno-reorder-init-list -Wno-implicit-int-float-conversion -Wno-c99-designator -Wno-final-dtor-non-final-class -Wno-extra-semi-stmt -Wno-misleading-indentation -Wno-quoted-include-in-framework-header -Wno-implicit-fallthrough -Wno-enum-enum-conversion -Wno-enum-float-conversion -Wno-elaborated-enum-base -Wno-reserved-identifier -Wno-gnu-folding-constant -fdeprecated-macro -fdebug-compilation-dir=/Users/kb7/Downloads/Quantization/llama.cpp/build/CMakeFiles/CMakeScratch/TryCompile-QVtX2E -ferror-limit 19 -stack-protector 1 -fstack-check -mdarwin-stkchk-strong-link -fblocks -fencode-extended-block-signature -fregister-global-dtors-with-atexit -fgnuc-version=4.2.1 -fno-cxx-modules -fcxx-exceptions -fexceptions -fmax-type-align=16 -fcommon -clang-vendor-feature=+disableNonDependentMemberExprInCurrentInstantiation -fno-odr-hash-protocols -clang-vendor-feature=+enableAggressiveVLAFolding -clang-vendor-feature=+revert09abecef7bbf -clang-vendor-feature=+thisNoAlignAttr -clang-vendor-feature=+thisNoNullAttr -clang-vendor-feature=+disableAtImportPrivateFrameworkInImplementationError -D__GCC_HAVE_DWARF2_CFI_ASM=1 -o CMakeFiles/cmTC_e7565.dir/CMakeCXXCompilerABI.cpp.o -x c++ /opt/homebrew/share/cmake/Modules/CMakeCXXCompilerABI.cpp]400        ignore line: [clang -cc1 version 16.0.0 (clang-1600.0.26.6) default target arm64-apple-darwin24.2.0]401        ignore line: [ignoring nonexistent directory "/Library/Developer/CommandLineTools/SDKs/MacOSX15.2.sdk/usr/local/include"]402        ignore line: [ignoring nonexistent directory "/Library/Developer/CommandLineTools/SDKs/MacOSX15.2.sdk/Library/Frameworks"]403        ignore line: [#include "..." search starts here:]404        ignore line: [#include <...> search starts here:]405        ignore line: [ /Library/Developer/CommandLineTools/SDKs/MacOSX15.2.sdk/usr/include/c++/v1]406        ignore line: [ /Library/Developer/CommandLineTools/usr/lib/clang/16/include]407        ignore line: [ /Library/Developer/CommandLineTools/SDKs/MacOSX15.2.sdk/usr/include]408        ignore line: [ /Library/Developer/CommandLineTools/usr/include]409        ignore line: [ /Library/Developer/CommandLineTools/SDKs/MacOSX15.2.sdk/System/Library/Frameworks (framework directory)]410        ignore line: [End of search list.]411        ignore line: [Linking CXX executable cmTC_e7565]412        ignore line: [/opt/homebrew/bin/cmake -E cmake_link_script CMakeFiles/cmTC_e7565.dir/link.txt --verbose=1]413        ignore line: [Apple clang version 16.0.0 (clang-1600.0.26.6)]414        ignore line: [Target: arm64-apple-darwin24.2.0]415        ignore line: [Thread model: posix]416        ignore line: [InstalledDir: /Library/Developer/CommandLineTools/usr/bin]417        link line: [ "/Library/Developer/CommandLineTools/usr/bin/ld" -demangle -lto_library /Library/Developer/CommandLineTools/usr/lib/libLTO.dylib -dynamic -arch arm64 -platform_version macos 15.0.0 15.2 -syslibroot /Library/Developer/CommandLineTools/SDKs/MacOSX15.2.sdk -mllvm -enable-linkonceodr-outlining -o cmTC_e7565 -search_paths_first -headerpad_max_install_names -v CMakeFiles/cmTC_e7565.dir/CMakeCXXCompilerABI.cpp.o -lc++ -lSystem /Library/Developer/CommandLineTools/usr/lib/clang/16/lib/darwin/libclang_rt.osx.a]418          arg [/Library/Developer/CommandLineTools/usr/bin/ld] ==> ignore419          arg [-demangle] ==> ignore420          arg [-lto_library] ==> ignore, skip following value421          arg [/Library/Developer/CommandLineTools/usr/lib/libLTO.dylib] ==> skip value of -lto_library422          arg [-dynamic] ==> ignore423          arg [-arch] ==> ignore424          arg [arm64] ==> ignore425          arg [-platform_version] ==> ignore426          arg [macos] ==> ignore427          arg [15.0.0] ==> ignore428          arg [15.2] ==> ignore429          arg [-syslibroot] ==> ignore430          arg [/Library/Developer/CommandLineTools/SDKs/MacOSX15.2.sdk] ==> ignore431          arg [-mllvm] ==> ignore432          arg [-enable-linkonceodr-outlining] ==> ignore433          arg [-o] ==> ignore434          arg [cmTC_e7565] ==> ignore435          arg [-search_paths_first] ==> ignore436          arg [-headerpad_max_install_names] ==> ignore437          arg [-v] ==> ignore438          arg [CMakeFiles/cmTC_e7565.dir/CMakeCXXCompilerABI.cpp.o] ==> ignore439          arg [-lc++] ==> lib [c++]440          arg [-lSystem] ==> lib [System]441          arg [/Library/Developer/CommandLineTools/usr/lib/clang/16/lib/darwin/libclang_rt.osx.a] ==> lib [/Library/Developer/CommandLineTools/usr/lib/clang/16/lib/darwin/libclang_rt.osx.a]442        linker tool for 'CXX': /Library/Developer/CommandLineTools/usr/bin/ld443        Library search paths: [;/Library/Developer/CommandLineTools/SDKs/MacOSX15.2.sdk/usr/lib;/Library/Developer/CommandLineTools/SDKs/MacOSX15.2.sdk/usr/lib/swift]444        Framework search paths: [;/Library/Developer/CommandLineTools/SDKs/MacOSX15.2.sdk/System/Library/Frameworks]445        remove lib [System]446        remove lib [/Library/Developer/CommandLineTools/usr/lib/clang/16/lib/darwin/libclang_rt.osx.a]447        collapse library dir [/Library/Developer/CommandLineTools/SDKs/MacOSX15.2.sdk/usr/lib] ==> [/Library/Developer/CommandLineTools/SDKs/MacOSX15.2.sdk/usr/lib]448        collapse library dir [/Library/Developer/CommandLineTools/SDKs/MacOSX15.2.sdk/usr/lib/swift] ==> [/Library/Developer/CommandLineTools/SDKs/MacOSX15.2.sdk/usr/lib/swift]449        collapse framework dir [/Library/Developer/CommandLineTools/SDKs/MacOSX15.2.sdk/System/Library/Frameworks] ==> [/Library/Developer/CommandLineTools/SDKs/MacOSX15.2.sdk/System/Library/Frameworks]450        implicit libs: [c++]451        implicit objs: []452        implicit dirs: [/Library/Developer/CommandLineTools/SDKs/MacOSX15.2.sdk/usr/lib;/Library/Developer/CommandLineTools/SDKs/MacOSX15.2.sdk/usr/lib/swift]453        implicit fwks: [/Library/Developer/CommandLineTools/SDKs/MacOSX15.2.sdk/System/Library/Frameworks]454      455      456  -457    kind: "message-v1"458    backtrace:459      - "/opt/homebrew/share/cmake/Modules/Internal/CMakeDetermineLinkerId.cmake:40 (message)"460      - "/opt/homebrew/share/cmake/Modules/CMakeDetermineCompilerABI.cmake:255 (cmake_determine_linker_id)"461      - "/opt/homebrew/share/cmake/Modules/CMakeTestCXXCompiler.cmake:26 (CMAKE_DETERMINE_COMPILER_ABI)"462      - "CMakeLists.txt:2 (project)"463    message: |464      Running the CXX compiler's linker: "/Library/Developer/CommandLineTools/usr/bin/ld" "-v"465      @(#)PROGRAM:ld PROJECT:ld-1115.7.3466      BUILD 23:52:02 Dec  5 2024467      configured to support archs: armv6 armv7 armv7s arm64 arm64e arm64_32 i386 x86_64 x86_64h armv6m armv7k armv7m armv7em468      will use ld-classic for: armv6 armv7 armv7s i386 armv6m armv7k armv7m armv7em469      LTO support using: LLVM version 16.0.0 (static support for 29, runtime is 29)470      TAPI support using: Apple TAPI version 16.0.0 (tapi-1600.0.11.9)471  -472    kind: "try_compile-v1"473    backtrace:474      - "/opt/homebrew/share/cmake/Modules/Internal/CheckSourceCompiles.cmake:108 (try_compile)"475      - "/opt/homebrew/share/cmake/Modules/CheckCSourceCompiles.cmake:58 (cmake_check_source_compiles)"476      - "/opt/homebrew/share/cmake/Modules/FindThreads.cmake:97 (CHECK_C_SOURCE_COMPILES)"477      - "/opt/homebrew/share/cmake/Modules/FindThreads.cmake:163 (_threads_check_libc)"478      - "ggml/CMakeLists.txt:210 (find_package)"479    checks:480      - "Performing Test CMAKE_HAVE_LIBC_PTHREAD"481    directories:482      source: "/Users/kb7/Downloads/Quantization/llama.cpp/build/CMakeFiles/CMakeScratch/TryCompile-iEJKXj"483      binary: "/Users/kb7/Downloads/Quantization/llama.cpp/build/CMakeFiles/CMakeScratch/TryCompile-iEJKXj"484    cmakeVariables:485      CMAKE_C_FLAGS: ""486      CMAKE_C_FLAGS_DEBUG: "-g"487      CMAKE_EXE_LINKER_FLAGS: ""488      CMAKE_MODULE_PATH: "/Users/kb7/Downloads/Quantization/llama.cpp/cmake/"489      CMAKE_OSX_ARCHITECTURES: ""490      CMAKE_OSX_DEPLOYMENT_TARGET: ""491      CMAKE_OSX_SYSROOT: "/Library/Developer/CommandLineTools/SDKs/MacOSX15.2.sdk"492    buildResult:493      variable: "CMAKE_HAVE_LIBC_PTHREAD"494      cached: true495      stdout: |496        Change Dir: '/Users/kb7/Downloads/Quantization/llama.cpp/build/CMakeFiles/CMakeScratch/TryCompile-iEJKXj'497        498        Run Build Command(s): /opt/homebrew/bin/cmake -E env VERBOSE=1 /usr/bin/make -f Makefile cmTC_e15cd/fast499        /Library/Developer/CommandLineTools/usr/bin/make  -f CMakeFiles/cmTC_e15cd.dir/build.make CMakeFiles/cmTC_e15cd.dir/build500        Building C object CMakeFiles/cmTC_e15cd.dir/src.c.o501        /Library/Developer/CommandLineTools/usr/bin/cc -DCMAKE_HAVE_LIBC_PTHREAD  -std=gnu11 -arch arm64 -isysroot /Library/Developer/CommandLineTools/SDKs/MacOSX15.2.sdk -MD -MT CMakeFiles/cmTC_e15cd.dir/src.c.o -MF CMakeFiles/cmTC_e15cd.dir/src.c.o.d -o CMakeFiles/cmTC_e15cd.dir/src.c.o -c /Users/kb7/Downloads/Quantization/llama.cpp/build/CMakeFiles/CMakeScratch/TryCompile-iEJKXj/src.c502        Linking C executable cmTC_e15cd503        /opt/homebrew/bin/cmake -E cmake_link_script CMakeFiles/cmTC_e15cd.dir/link.txt --verbose=1504        /Library/Developer/CommandLineTools/usr/bin/cc  -arch arm64 -isysroot /Library/Developer/CommandLineTools/SDKs/MacOSX15.2.sdk -Wl,-search_paths_first -Wl,-headerpad_max_install_names CMakeFiles/cmTC_e15cd.dir/src.c.o -o cmTC_e15cd505        506      exitCode: 0507  -508    kind: "try_compile-v1"509    backtrace:510      - "/opt/homebrew/share/cmake/Modules/FindOpenMP.cmake:252 (try_compile)"511      - "/opt/homebrew/share/cmake/Modules/FindOpenMP.cmake:522 (_OPENMP_GET_FLAGS)"512      - "ggml/src/ggml-cpu/CMakeLists.txt:47 (find_package)"513      - "ggml/src/CMakeLists.txt:318 (ggml_add_cpu_backend_variant_impl)"514    description: "Detecting C OpenMP compiler info"515    directories:516      source: "/Users/kb7/Downloads/Quantization/llama.cpp/build/CMakeFiles/CMakeScratch/TryCompile-ol6tjM"517      binary: "/Users/kb7/Downloads/Quantization/llama.cpp/build/CMakeFiles/CMakeScratch/TryCompile-ol6tjM"518    cmakeVariables:519      CMAKE_C_FLAGS: ""520      CMAKE_C_FLAGS_DEBUG: "-g"521      CMAKE_EXE_LINKER_FLAGS: ""522      CMAKE_MODULE_PATH: "/Users/kb7/Downloads/Quantization/llama.cpp/cmake/"523      CMAKE_OSX_ARCHITECTURES: ""524      CMAKE_OSX_DEPLOYMENT_TARGET: ""525      CMAKE_OSX_SYSROOT: "/Library/Developer/CommandLineTools/SDKs/MacOSX15.2.sdk"526    buildResult:527      variable: "OpenMP_COMPILE_RESULT_C_Xclang fopenmp"528      cached: true529      stdout: |530        Change Dir: '/Users/kb7/Downloads/Quantization/llama.cpp/build/CMakeFiles/CMakeScratch/TryCompile-ol6tjM'531        532        Run Build Command(s): /opt/homebrew/bin/cmake -E env VERBOSE=1 /usr/bin/make -f Makefile cmTC_67526/fast533        /Library/Developer/CommandLineTools/usr/bin/make  -f CMakeFiles/cmTC_67526.dir/build.make CMakeFiles/cmTC_67526.dir/build534        Building C object CMakeFiles/cmTC_67526.dir/OpenMPTryFlag.c.o535        /Library/Developer/CommandLineTools/usr/bin/cc   -Xclang -fopenmp -std=gnu11 -arch arm64 -isysroot /Library/Developer/CommandLineTools/SDKs/MacOSX15.2.sdk -MD -MT CMakeFiles/cmTC_67526.dir/OpenMPTryFlag.c.o -MF CMakeFiles/cmTC_67526.dir/OpenMPTryFlag.c.o.d -o CMakeFiles/cmTC_67526.dir/OpenMPTryFlag.c.o -c /Users/kb7/Downloads/Quantization/llama.cpp/build/CMakeFiles/CMakeScratch/TryCompile-ol6tjM/OpenMPTryFlag.c536        /Users/kb7/Downloads/Quantization/llama.cpp/build/CMakeFiles/CMakeScratch/TryCompile-ol6tjM/OpenMPTryFlag.c:2:10: fatal error: 'omp.h' file not found537            2 | #include <omp.h>538              |          ^~~~~~~539        1 error generated.540        make[1]: *** [CMakeFiles/cmTC_67526.dir/OpenMPTryFlag.c.o] Error 1541        make: *** [cmTC_67526/fast] Error 2542        543      exitCode: 2544  -545    kind: "try_compile-v1"546    backtrace:547      - "/opt/homebrew/share/cmake/Modules/FindOpenMP.cmake:252 (try_compile)"548      - "/opt/homebrew/share/cmake/Modules/FindOpenMP.cmake:522 (_OPENMP_GET_FLAGS)"549      - "ggml/src/ggml-cpu/CMakeLists.txt:47 (find_package)"550      - "ggml/src/CMakeLists.txt:318 (ggml_add_cpu_backend_variant_impl)"551    description: "Detecting CXX OpenMP compiler info"552    directories:553      source: "/Users/kb7/Downloads/Quantization/llama.cpp/build/CMakeFiles/CMakeScratch/TryCompile-HwPHDp"554      binary: "/Users/kb7/Downloads/Quantization/llama.cpp/build/CMakeFiles/CMakeScratch/TryCompile-HwPHDp"555    cmakeVariables:556      CMAKE_CXX_FLAGS: ""557      CMAKE_CXX_FLAGS_DEBUG: "-g"558      CMAKE_EXE_LINKER_FLAGS: ""559      CMAKE_MODULE_PATH: "/Users/kb7/Downloads/Quantization/llama.cpp/cmake/"560      CMAKE_OSX_ARCHITECTURES: ""561      CMAKE_OSX_DEPLOYMENT_TARGET: ""562      CMAKE_OSX_SYSROOT: "/Library/Developer/CommandLineTools/SDKs/MacOSX15.2.sdk"563    buildResult:564      variable: "OpenMP_COMPILE_RESULT_CXX_Xclang fopenmp"565      cached: true566      stdout: |567        Change Dir: '/Users/kb7/Downloads/Quantization/llama.cpp/build/CMakeFiles/CMakeScratch/TryCompile-HwPHDp'568        569        Run Build Command(s): /opt/homebrew/bin/cmake -E env VERBOSE=1 /usr/bin/make -f Makefile cmTC_b40ed/fast570        /Library/Developer/CommandLineTools/usr/bin/make  -f CMakeFiles/cmTC_b40ed.dir/build.make CMakeFiles/cmTC_b40ed.dir/build571        Building CXX object CMakeFiles/cmTC_b40ed.dir/OpenMPTryFlag.cpp.o572        /Library/Developer/CommandLineTools/usr/bin/c++   -Xclang -fopenmp -std=gnu++17 -arch arm64 -isysroot /Library/Developer/CommandLineTools/SDKs/MacOSX15.2.sdk -MD -MT CMakeFiles/cmTC_b40ed.dir/OpenMPTryFlag.cpp.o -MF CMakeFiles/cmTC_b40ed.dir/OpenMPTryFlag.cpp.o.d -o CMakeFiles/cmTC_b40ed.dir/OpenMPTryFlag.cpp.o -c /Users/kb7/Downloads/Quantization/llama.cpp/build/CMakeFiles/CMakeScratch/TryCompile-HwPHDp/OpenMPTryFlag.cpp573        /Users/kb7/Downloads/Quantization/llama.cpp/build/CMakeFiles/CMakeScratch/TryCompile-HwPHDp/OpenMPTryFlag.cpp:2:10: fatal error: 'omp.h' file not found574            2 | #include <omp.h>575              |          ^~~~~~~576        1 error generated.577        make[1]: *** [CMakeFiles/cmTC_b40ed.dir/OpenMPTryFlag.cpp.o] Error 1578        make: *** [cmTC_b40ed/fast] Error 2579        580      exitCode: 2581  -582    kind: "try_compile-v1"583    backtrace:584      - "/opt/homebrew/share/cmake/Modules/Internal/CheckSourceCompiles.cmake:108 (try_compile)"585      - "/opt/homebrew/share/cmake/Modules/Internal/CheckCompilerFlag.cmake:18 (cmake_check_source_compiles)"586      - "/opt/homebrew/share/cmake/Modules/CheckCXXCompilerFlag.cmake:55 (cmake_check_compiler_flag)"587      - "ggml/src/ggml-cpu/CMakeLists.txt:85 (check_cxx_compiler_flag)"588      - "ggml/src/CMakeLists.txt:318 (ggml_add_cpu_backend_variant_impl)"589    checks:590      - "Performing Test GGML_COMPILER_SUPPORTS_FP16_FORMAT_I3E"591    directories:592      source: "/Users/kb7/Downloads/Quantization/llama.cpp/build/CMakeFiles/CMakeScratch/TryCompile-Q3vEoe"593      binary: "/Users/kb7/Downloads/Quantization/llama.cpp/build/CMakeFiles/CMakeScratch/TryCompile-Q3vEoe"594    cmakeVariables:595      CMAKE_CXX_FLAGS: ""596      CMAKE_CXX_FLAGS_DEBUG: "-g"597      CMAKE_EXE_LINKER_FLAGS: ""598      CMAKE_MODULE_PATH: "/Users/kb7/Downloads/Quantization/llama.cpp/cmake/"599      CMAKE_OSX_ARCHITECTURES: ""600      CMAKE_OSX_DEPLOYMENT_TARGET: ""601      CMAKE_OSX_SYSROOT: "/Library/Developer/CommandLineTools/SDKs/MacOSX15.2.sdk"602    buildResult:603      variable: "GGML_COMPILER_SUPPORTS_FP16_FORMAT_I3E"604      cached: true605      stdout: |606        Change Dir: '/Users/kb7/Downloads/Quantization/llama.cpp/build/CMakeFiles/CMakeScratch/TryCompile-Q3vEoe'607        608        Run Build Command(s): /opt/homebrew/bin/cmake -E env VERBOSE=1 /usr/bin/make -f Makefile cmTC_f3662/fast609        /Library/Developer/CommandLineTools/usr/bin/make  -f CMakeFiles/cmTC_f3662.dir/build.make CMakeFiles/cmTC_f3662.dir/build610        Building CXX object CMakeFiles/cmTC_f3662.dir/src.cxx.o611        /Library/Developer/CommandLineTools/usr/bin/c++ -DGGML_COMPILER_SUPPORTS_FP16_FORMAT_I3E  -std=gnu++17 -arch arm64 -isysroot /Library/Developer/CommandLineTools/SDKs/MacOSX15.2.sdk   -mfp16-format=ieee -MD -MT CMakeFiles/cmTC_f3662.dir/src.cxx.o -MF CMakeFiles/cmTC_f3662.dir/src.cxx.o.d -o CMakeFiles/cmTC_f3662.dir/src.cxx.o -c /Users/kb7/Downloads/Quantization/llama.cpp/build/CMakeFiles/CMakeScratch/TryCompile-Q3vEoe/src.cxx612        c++: error: unknown argument: '-mfp16-format=ieee'613        make[1]: *** [CMakeFiles/cmTC_f3662.dir/src.cxx.o] Error 1614        make: *** [cmTC_f3662/fast] Error 2615        616      exitCode: 2617  -618    kind: "try_run-v1"619    backtrace:620      - "/opt/homebrew/share/cmake/Modules/Internal/CheckSourceRuns.cmake:99 (try_run)"621      - "/opt/homebrew/share/cmake/Modules/CheckCXXSourceRuns.cmake:52 (cmake_check_source_runs)"622      - "ggml/src/ggml-cpu/CMakeLists.txt:114 (check_cxx_source_runs)"623      - "ggml/src/ggml-cpu/CMakeLists.txt:126 (check_arm_feature)"624      - "ggml/src/CMakeLists.txt:318 (ggml_add_cpu_backend_variant_impl)"625    checks:626      - "Performing Test GGML_MACHINE_SUPPORTS_dotprod"627    directories:628      source: "/Users/kb7/Downloads/Quantization/llama.cpp/build/CMakeFiles/CMakeScratch/TryCompile-UXLQwc"629      binary: "/Users/kb7/Downloads/Quantization/llama.cpp/build/CMakeFiles/CMakeScratch/TryCompile-UXLQwc"630    cmakeVariables:631      CMAKE_CXX_FLAGS: ""632      CMAKE_CXX_FLAGS_DEBUG: "-g"633      CMAKE_EXE_LINKER_FLAGS: ""634      CMAKE_MODULE_PATH: "/Users/kb7/Downloads/Quantization/llama.cpp/cmake/"635      CMAKE_OSX_ARCHITECTURES: ""636      CMAKE_OSX_DEPLOYMENT_TARGET: ""637      CMAKE_OSX_SYSROOT: "/Library/Developer/CommandLineTools/SDKs/MacOSX15.2.sdk"638    buildResult:639      variable: "GGML_MACHINE_SUPPORTS_dotprod_COMPILED"640      cached: true641      stdout: |642        Change Dir: '/Users/kb7/Downloads/Quantization/llama.cpp/build/CMakeFiles/CMakeScratch/TryCompile-UXLQwc'643        644        Run Build Command(s): /opt/homebrew/bin/cmake -E env VERBOSE=1 /usr/bin/make -f Makefile cmTC_c36fe/fast645        /Library/Developer/CommandLineTools/usr/bin/make  -f CMakeFiles/cmTC_c36fe.dir/build.make CMakeFiles/cmTC_c36fe.dir/build646        Building CXX object CMakeFiles/cmTC_c36fe.dir/src.cxx.o647        /Library/Developer/CommandLineTools/usr/bin/c++ -DGGML_MACHINE_SUPPORTS_dotprod  -mcpu=native+dotprod -std=gnu++17 -arch arm64 -isysroot /Library/Developer/CommandLineTools/SDKs/MacOSX15.2.sdk -MD -MT CMakeFiles/cmTC_c36fe.dir/src.cxx.o -MF CMakeFiles/cmTC_c36fe.dir/src.cxx.o.d -o CMakeFiles/cmTC_c36fe.dir/src.cxx.o -c /Users/kb7/Downloads/Quantization/llama.cpp/build/CMakeFiles/CMakeScratch/TryCompile-UXLQwc/src.cxx648        Linking CXX executable cmTC_c36fe649        /opt/homebrew/bin/cmake -E cmake_link_script CMakeFiles/cmTC_c36fe.dir/link.txt --verbose=1650        /Library/Developer/CommandLineTools/usr/bin/c++  -mcpu=native+dotprod -arch arm64 -isysroot /Library/Developer/CommandLineTools/SDKs/MacOSX15.2.sdk -Wl,-search_paths_first -Wl,-headerpad_max_install_names CMakeFiles/cmTC_c36fe.dir/src.cxx.o -o cmTC_c36fe651        652      exitCode: 0653    runResult:654      variable: "GGML_MACHINE_SUPPORTS_dotprod_EXITCODE"655      cached: true656      stdout: |657      stderr: |658      exitCode: 0659  -660    kind: "try_run-v1"661    backtrace:662      - "/opt/homebrew/share/cmake/Modules/Internal/CheckSourceRuns.cmake:99 (try_run)"663      - "/opt/homebrew/share/cmake/Modules/CheckCXXSourceRuns.cmake:52 (cmake_check_source_runs)"664      - "ggml/src/ggml-cpu/CMakeLists.txt:114 (check_cxx_source_runs)"665      - "ggml/src/ggml-cpu/CMakeLists.txt:127 (check_arm_feature)"666      - "ggml/src/CMakeLists.txt:318 (ggml_add_cpu_backend_variant_impl)"667    checks:668      - "Performing Test GGML_MACHINE_SUPPORTS_i8mm"669    directories:670      source: "/Users/kb7/Downloads/Quantization/llama.cpp/build/CMakeFiles/CMakeScratch/TryCompile-BUCDD2"671      binary: "/Users/kb7/Downloads/Quantization/llama.cpp/build/CMakeFiles/CMakeScratch/TryCompile-BUCDD2"672    cmakeVariables:673      CMAKE_CXX_FLAGS: ""674      CMAKE_CXX_FLAGS_DEBUG: "-g"675      CMAKE_EXE_LINKER_FLAGS: ""676      CMAKE_MODULE_PATH: "/Users/kb7/Downloads/Quantization/llama.cpp/cmake/"677      CMAKE_OSX_ARCHITECTURES: ""678      CMAKE_OSX_DEPLOYMENT_TARGET: ""679      CMAKE_OSX_SYSROOT: "/Library/Developer/CommandLineTools/SDKs/MacOSX15.2.sdk"680    buildResult:681      variable: "GGML_MACHINE_SUPPORTS_i8mm_COMPILED"682      cached: true683      stdout: |684        Change Dir: '/Users/kb7/Downloads/Quantization/llama.cpp/build/CMakeFiles/CMakeScratch/TryCompile-BUCDD2'685        686        Run Build Command(s): /opt/homebrew/bin/cmake -E env VERBOSE=1 /usr/bin/make -f Makefile cmTC_926f8/fast687        /Library/Developer/CommandLineTools/usr/bin/make  -f CMakeFiles/cmTC_926f8.dir/build.make CMakeFiles/cmTC_926f8.dir/build688        Building CXX object CMakeFiles/cmTC_926f8.dir/src.cxx.o689        /Library/Developer/CommandLineTools/usr/bin/c++ -DGGML_MACHINE_SUPPORTS_i8mm  -mcpu=native+i8mm -std=gnu++17 -arch arm64 -isysroot /Library/Developer/CommandLineTools/SDKs/MacOSX15.2.sdk -MD -MT CMakeFiles/cmTC_926f8.dir/src.cxx.o -MF CMakeFiles/cmTC_926f8.dir/src.cxx.o.d -o CMakeFiles/cmTC_926f8.dir/src.cxx.o -c /Users/kb7/Downloads/Quantization/llama.cpp/build/CMakeFiles/CMakeScratch/TryCompile-BUCDD2/src.cxx690        Linking CXX executable cmTC_926f8691        /opt/homebrew/bin/cmake -E cmake_link_script CMakeFiles/cmTC_926f8.dir/link.txt --verbose=1692        /Library/Developer/CommandLineTools/usr/bin/c++  -mcpu=native+i8mm -arch arm64 -isysroot /Library/Developer/CommandLineTools/SDKs/MacOSX15.2.sdk -Wl,-search_paths_first -Wl,-headerpad_max_install_names CMakeFiles/cmTC_926f8.dir/src.cxx.o -o cmTC_926f8693        694      exitCode: 0695    runResult:696      variable: "GGML_MACHINE_SUPPORTS_i8mm_EXITCODE"697      cached: true698      stdout: |699      stderr: |700        Illegal instruction701      exitCode: "FAILED_TO_RUN"702  -703    kind: "try_run-v1"704    backtrace:705      - "/opt/homebrew/share/cmake/Modules/Internal/CheckSourceRuns.cmake:99 (try_run)"706      - "/opt/homebrew/share/cmake/Modules/CheckCXXSourceRuns.cmake:52 (cmake_check_source_runs)"707      - "ggml/src/ggml-cpu/CMakeLists.txt:114 (check_cxx_source_runs)"708      - "ggml/src/ggml-cpu/CMakeLists.txt:128 (check_arm_feature)"709      - "ggml/src/CMakeLists.txt:318 (ggml_add_cpu_backend_variant_impl)"710    checks:711      - "Performing Test GGML_MACHINE_SUPPORTS_sve"712    directories:713      source: "/Users/kb7/Downloads/Quantization/llama.cpp/build/CMakeFiles/CMakeScratch/TryCompile-IfcOiL"714      binary: "/Users/kb7/Downloads/Quantization/llama.cpp/build/CMakeFiles/CMakeScratch/TryCompile-IfcOiL"715    cmakeVariables:716      CMAKE_CXX_FLAGS: ""717      CMAKE_CXX_FLAGS_DEBUG: "-g"718      CMAKE_EXE_LINKER_FLAGS: ""719      CMAKE_MODULE_PATH: "/Users/kb7/Downloads/Quantization/llama.cpp/cmake/"720      CMAKE_OSX_ARCHITECTURES: ""721      CMAKE_OSX_DEPLOYMENT_TARGET: ""722      CMAKE_OSX_SYSROOT: "/Library/Developer/CommandLineTools/SDKs/MacOSX15.2.sdk"723    buildResult:724      variable: "GGML_MACHINE_SUPPORTS_sve_COMPILED"725      cached: true726      stdout: |727        Change Dir: '/Users/kb7/Downloads/Quantization/llama.cpp/build/CMakeFiles/CMakeScratch/TryCompile-IfcOiL'728        729        Run Build Command(s): /opt/homebrew/bin/cmake -E env VERBOSE=1 /usr/bin/make -f Makefile cmTC_9069f/fast730        /Library/Developer/CommandLineTools/usr/bin/make  -f CMakeFiles/cmTC_9069f.dir/build.make CMakeFiles/cmTC_9069f.dir/build731        Building CXX object CMakeFiles/cmTC_9069f.dir/src.cxx.o732        /Library/Developer/CommandLineTools/usr/bin/c++ -DGGML_MACHINE_SUPPORTS_sve  -mcpu=native+sve -std=gnu++17 -arch arm64 -isysroot /Library/Developer/CommandLineTools/SDKs/MacOSX15.2.sdk -MD -MT CMakeFiles/cmTC_9069f.dir/src.cxx.o -MF CMakeFiles/cmTC_9069f.dir/src.cxx.o.d -o CMakeFiles/cmTC_9069f.dir/src.cxx.o -c /Users/kb7/Downloads/Quantization/llama.cpp/build/CMakeFiles/CMakeScratch/TryCompile-IfcOiL/src.cxx733        Linking CXX executable cmTC_9069f734        /opt/homebrew/bin/cmake -E cmake_link_script CMakeFiles/cmTC_9069f.dir/link.txt --verbose=1735        /Library/Developer/CommandLineTools/usr/bin/c++  -mcpu=native+sve -arch arm64 -isysroot /Library/Developer/CommandLineTools/SDKs/MacOSX15.2.sdk -Wl,-search_paths_first -Wl,-headerpad_max_install_names CMakeFiles/cmTC_9069f.dir/src.cxx.o -o cmTC_9069f736        737      exitCode: 0738    runResult:739      variable: "GGML_MACHINE_SUPPORTS_sve_EXITCODE"740      cached: true741      stdout: |742      stderr: |743        Illegal instruction744      exitCode: "FAILED_TO_RUN"745  -746    kind: "try_compile-v1"747    backtrace:748      - "/opt/homebrew/share/cmake/Modules/CheckFunctionExists.cmake:93 (try_compile)"749      - "/opt/homebrew/share/cmake/Modules/FindBLAS.cmake:379 (check_function_exists)"750      - "/opt/homebrew/share/cmake/Modules/FindBLAS.cmake:1218 (check_blas_libraries)"751      - "ggml/src/ggml-blas/CMakeLists.txt:9 (find_package)"752    checks:753      - "Looking for dgemm_"754    directories:755      source: "/Users/kb7/Downloads/Quantization/llama.cpp/build/CMakeFiles/CMakeScratch/TryCompile-RGF1uV"756      binary: "/Users/kb7/Downloads/Quantization/llama.cpp/build/CMakeFiles/CMakeScratch/TryCompile-RGF1uV"757    cmakeVariables:758      CMAKE_C_FLAGS: ""759      CMAKE_C_FLAGS_DEBUG: "-g"760      CMAKE_EXE_LINKER_FLAGS: ""761      CMAKE_MODULE_PATH: "/Users/kb7/Downloads/Quantization/llama.cpp/cmake/"762      CMAKE_OSX_ARCHITECTURES: ""763      CMAKE_OSX_DEPLOYMENT_TARGET: ""764      CMAKE_OSX_SYSROOT: "/Library/Developer/CommandLineTools/SDKs/MacOSX15.2.sdk"765    buildResult:766      variable: "BLAS_Accelerate_WORKS"767      cached: true768      stdout: |769        Change Dir: '/Users/kb7/Downloads/Quantization/llama.cpp/build/CMakeFiles/CMakeScratch/TryCompile-RGF1uV'770        771        Run Build Command(s): /opt/homebrew/bin/cmake -E env VERBOSE=1 /usr/bin/make -f Makefile cmTC_0c97a/fast772        /Library/Developer/CommandLineTools/usr/bin/make  -f CMakeFiles/cmTC_0c97a.dir/build.make CMakeFiles/cmTC_0c97a.dir/build773        Building C object CMakeFiles/cmTC_0c97a.dir/CheckFunctionExists.c.o774        /Library/Developer/CommandLineTools/usr/bin/cc  -F/Library/Developer/CommandLineTools/SDKs/MacOSX15.2.sdk/System/Library/Frameworks -DCHECK_FUNCTION_EXISTS=dgemm_ -std=gnu11 -arch arm64 -isysroot /Library/Developer/CommandLineTools/SDKs/MacOSX15.2.sdk -MD -MT CMakeFiles/cmTC_0c97a.dir/CheckFunctionExists.c.o -MF CMakeFiles/cmTC_0c97a.dir/CheckFunctionExists.c.o.d -o CMakeFiles/cmTC_0c97a.dir/CheckFunctionExists.c.o -c /Users/kb7/Downloads/Quantization/llama.cpp/build/CMakeFiles/CMakeScratch/TryCompile-RGF1uV/CheckFunctionExists.c775        Linking C executable cmTC_0c97a776        /opt/homebrew/bin/cmake -E cmake_link_script CMakeFiles/cmTC_0c97a.dir/link.txt --verbose=1777        /Library/Developer/CommandLineTools/usr/bin/cc  -DCHECK_FUNCTION_EXISTS=dgemm_ -arch arm64 -isysroot /Library/Developer/CommandLineTools/SDKs/MacOSX15.2.sdk -Wl,-search_paths_first -Wl,-headerpad_max_install_names CMakeFiles/cmTC_0c97a.dir/CheckFunctionExists.c.o -o cmTC_0c97a  -framework Accelerate778        779      exitCode: 0780  -781    kind: "message-v1"782    backtrace:783      - "/opt/homebrew/share/cmake/Modules/CMakeDetermineCompilerId.cmake:1250 (message)"784      - "/opt/homebrew/share/cmake/Modules/CMakeDetermineASMCompiler.cmake:135 (CMAKE_DETERMINE_COMPILER_ID_VENDOR)"785      - "ggml/src/ggml-metal/CMakeLists.txt:31 (enable_language)"786    message: |787      Checking whether the ASM compiler is GNU using "--version" did not match "(GNU assembler)|(GCC)|(Free Software Foundation)":788      Apple clang version 16.0.0 (clang-1600.0.26.6)789      Target: arm64-apple-darwin24.2.0790      Thread model: posix791      InstalledDir: /Library/Developer/CommandLineTools/usr/bin792  -793    kind: "message-v1"794    backtrace:795      - "/opt/homebrew/share/cmake/Modules/CMakeDetermineCompilerId.cmake:1237 (message)"796      - "/opt/homebrew/share/cmake/Modules/CMakeDetermineASMCompiler.cmake:135 (CMAKE_DETERMINE_COMPILER_ID_VENDOR)"797      - "ggml/src/ggml-metal/CMakeLists.txt:31 (enable_language)"798    message: |799      Checking whether the ASM compiler is AppleClang using "--version" matched "(Apple (clang|LLVM) version)":800      Apple clang version 16.0.0 (clang-1600.0.26.6)801      Target: arm64-apple-darwin24.2.0802      Thread model: posix803      InstalledDir: /Library/Developer/CommandLineTools/usr/bin804...805