Team Ai
Modelpublic

karths/binary_classification_train_port

sourceHugging Faceupdated 4mo agoView on Hugging Face
0likes204downloads
test_top_repo_data.csv6790 linesDownload Raw Back to root
1Unnamed: 0,id,type,created_at,repo,repo_url,action,title,labels,body,index,text_combine,label,text,binary_label232963,8981995016.0,IssuesEvent,2019-01-31 00:08:09,JordanMartinez/purescript-jordans-reference,https://api.github.com/repos/JordanMartinez/purescript-jordans-reference,opened,Include 'Solutions to Common Bower problems' in this repo,Build-Tools enhancement,"Include the work I did in purescript/documentation#237 but which wasn't included due to being 'out of the scope of project goals.'3 4<hr>5 6> **Warning:** if you are exploring PureScript and a compiler release was made recently, read `Breaking Compiler Changes and Bower`7 8#### Solutions to Common Problems with Bower9 10At various times, you might encounter a problem with Bower due to its cache mechanism. When in doubt, run the following command and see if that fixes your issue:11```bash12# Deletes the 'bower_modules' and 'output' directories,13# ensuring that the next build will be completely fresh.14rm -rf bower_modules/ output/15```16 17<hr>18 19# Breaking Compiler Changes and Bower20 21The following issue is happening less and less frequently, but still needs to be stated.22 23## Annoyance Defined24 25If a compiler release that includes breaking changes was released recently, it will take some time for libraries in the ecosystem to become compatible with that release. If you are using Bower as your dependency manager, it may try to install libraries that are and are not compatible with the new release, creating problems.26 27## Recommended Guidelines28 29In such circumstances, follow these guidelines to help find the correct version of a library:30- Go to Pursuit and look at the library's package page. Choose one of the library's versions and compare that version's publish date with the date of the compiler release. Those that occur after the compiler release are likely compatible with the new release.31- Since `purescript-prelude` is a dependency for most libraries, see which version of `purescript-prelude` the library uses. That should indicate whether it's compatible with a new compiler release or not.32- If all else fails, check the library's last few commit messages in its repository for any messages about updating to the new compiler release.33",1.0,"Include 'Solutions to Common Bower problems' in this repo - Include the work I did in purescript/documentation#237 but which wasn't included due to being 'out of the scope of project goals.'34 35<hr>36 37> **Warning:** if you are exploring PureScript and a compiler release was made recently, read `Breaking Compiler Changes and Bower`38 39#### Solutions to Common Problems with Bower40 41At various times, you might encounter a problem with Bower due to its cache mechanism. When in doubt, run the following command and see if that fixes your issue:42```bash43# Deletes the 'bower_modules' and 'output' directories,44# ensuring that the next build will be completely fresh.45rm -rf bower_modules/ output/46```47 48<hr>49 50# Breaking Compiler Changes and Bower51 52The following issue is happening less and less frequently, but still needs to be stated.53 54## Annoyance Defined55 56If a compiler release that includes breaking changes was released recently, it will take some time for libraries in the ecosystem to become compatible with that release. If you are using Bower as your dependency manager, it may try to install libraries that are and are not compatible with the new release, creating problems.57 58## Recommended Guidelines59 60In such circumstances, follow these guidelines to help find the correct version of a library:61- Go to Pursuit and look at the library's package page. Choose one of the library's versions and compare that version's publish date with the date of the compiler release. Those that occur after the compiler release are likely compatible with the new release.62- Since `purescript-prelude` is a dependency for most libraries, see which version of `purescript-prelude` the library uses. That should indicate whether it's compatible with a new compiler release or not.63- If all else fails, check the library's last few commit messages in its repository for any messages about updating to the new compiler release.64",0,include  solutions to common bower problems  in this repo   include the work i did in purescript documentation   but which wasn t included due to being  out of the scope of project goals               warning    if you are exploring purescript and a compiler release was made recently  read  breaking compiler changes and bower          solutions to common problems with bower    at various times  you might encounter a problem with bower due to its cache mechanism  when in doubt  run the following command and see if that fixes your issue      bash    deletes the  bower modules  and  output  directories     ensuring that the next build will be completely fresh   rm  rf bower modules  output                 breaking compiler changes and bower    the following issue is happening less and less frequently  but still needs to be stated        annoyance defined    if a compiler release that includes breaking changes was released recently  it will take some time for libraries in the ecosystem to become compatible with that release  if you are using bower as your dependency manager  it may try to install libraries that are and are not compatible with the new release  creating problems        recommended guidelines    in such circumstances  follow these guidelines to help find the correct version of a library     go to pursuit and look at the library s package page  choose one of the library s versions and compare that version s publish date with the date of the compiler release  those that occur after the compiler release are likely compatible with the new release     since  purescript prelude  is a dependency for most libraries  see which version of  purescript prelude  the library uses  that should indicate whether it s compatible with a new compiler release or not     if all else fails  check the library s last few commit messages in its repository for any messages about updating to the new compiler release   ,065808,10546855565.0,IssuesEvent,2019-10-02 22:45:18,magnumripper/JohnTheRipper,https://api.github.com/repos/magnumripper/JohnTheRipper,closed,OpenCL formats failing on macOS with AMD Radeon Pro 560,notes/external issues portability,"This is a hopeless OpenCL runtime (just like the macOS nvidia one). See also #3234 66 67Note that this list does NOT show the 50+ formats that do work fine ๐Ÿ˜† 68```69Device 2: AMD Radeon Pro 560 Compute Engine70Testing: sha512crypt-opencl, crypt(3) $6$ (rounds=5000) [SHA512 OpenCL]... FAILED (cmp_all(1))71Testing: descrypt-opencl, traditional crypt(3) [DES OpenCL]... Options used: -I /Users/magnum/src/john/run/kernels -cl-mad-enable -D__OS_X__ -D__GPU__ -DDEVICE_INFO=10 -DSIZEOF_SIZE_T=8 -DDEV_VER_MAJOR=1 -DDEV_VER_MINOR=2 -D_OPENCL_COMPILER -D WORK_GROUP_SIZE=8 -D USE_LOCAL_MEM=1 $JOHN/kernels/DES_bs_kernel.cl72Build log: Error returned by cvms_element_build_from_source73Error -11 building kernel $JOHN/kernels/DES_bs_kernel.cl. DEVICE_INFO=1074OpenCL CL_BUILD_PROGRAM_FAILURE (-11) error in opencl_common.c:1168 - clBuildProgram failed.75```76```77Testing: geli-opencl, FreeBSD GELI [PBKDF2-SHA512 AES OpenCL]... FAILED (cmp_all(1))78Testing: keyring-opencl, GNOME Keyring [SHA256 AES OpenCL]... FAILED (cmp_all(1))79Testing: krb5pa-md5-opencl, Kerberos 5 AS-REQ Pre-Auth etype 23 [MD4 HMAC-MD5 RC4 OpenCL]... FAILED (cmp_one(0))80Testing: krb5pa-sha1-opencl, Kerberos 5 AS-REQ Pre-Auth etype 17/18 [PBKDF2-SHA1 OpenCL]... FAILED (cmp_all(1))81Testing: ntlmv2-opencl, NTLMv2 C/R [MD4 HMAC-MD5 OpenCL]... FAILED (cmp_one(0))82Testing: pgpdisk-opencl [SHA1 OpenCL]... (8xOMP) FAILED (cmp_all(3))83Testing: pgpwde-opencl [SHA1 AES OpenCL]... FAILED (cmp_all(1))84Testing: Raw-SHA512-free-opencl [SHA512 OpenCL (inefficient, development use mostly)]... FAILED (cmp_all(1))85Testing: Raw-SHA512-opencl [SHA512 OpenCL]... FAILED (cmp_one(0))86Testing: wpapsk-opencl, WPA/WPA2/PMF PSK [PBKDF2-SHA1 OpenCL]... FAILED (cmp_all(7))87Testing: wpapsk-pmk-opencl, WPA/WPA2/PMF master key [MD5/SHA-1/SHA-2 OpenCL]... FAILED (cmp_all(3))88Testing: XSHA512-free-opencl, Mac OS X 10.7+ [SHA512 OpenCL (efficient at ""many salts"" only)]... FAILED (cmp_all(1))89Testing: XSHA512-opencl, Mac OS X 10.7 salted [SHA512 OpenCL]... FAILED (cmp_one(0))90```91 92The Intel GPU and Intel CPU devices passes all self-tests (see #3245).",True,"OpenCL formats failing on macOS with AMD Radeon Pro 560 - This is a hopeless OpenCL runtime (just like the macOS nvidia one). See also #3234 93 94Note that this list does NOT show the 50+ formats that do work fine ๐Ÿ˜† 95```96Device 2: AMD Radeon Pro 560 Compute Engine97Testing: sha512crypt-opencl, crypt(3) $6$ (rounds=5000) [SHA512 OpenCL]... FAILED (cmp_all(1))98Testing: descrypt-opencl, traditional crypt(3) [DES OpenCL]... Options used: -I /Users/magnum/src/john/run/kernels -cl-mad-enable -D__OS_X__ -D__GPU__ -DDEVICE_INFO=10 -DSIZEOF_SIZE_T=8 -DDEV_VER_MAJOR=1 -DDEV_VER_MINOR=2 -D_OPENCL_COMPILER -D WORK_GROUP_SIZE=8 -D USE_LOCAL_MEM=1 $JOHN/kernels/DES_bs_kernel.cl99Build log: Error returned by cvms_element_build_from_source100Error -11 building kernel $JOHN/kernels/DES_bs_kernel.cl. DEVICE_INFO=10101OpenCL CL_BUILD_PROGRAM_FAILURE (-11) error in opencl_common.c:1168 - clBuildProgram failed.102```103```104Testing: geli-opencl, FreeBSD GELI [PBKDF2-SHA512 AES OpenCL]... FAILED (cmp_all(1))105Testing: keyring-opencl, GNOME Keyring [SHA256 AES OpenCL]... FAILED (cmp_all(1))106Testing: krb5pa-md5-opencl, Kerberos 5 AS-REQ Pre-Auth etype 23 [MD4 HMAC-MD5 RC4 OpenCL]... FAILED (cmp_one(0))107Testing: krb5pa-sha1-opencl, Kerberos 5 AS-REQ Pre-Auth etype 17/18 [PBKDF2-SHA1 OpenCL]... FAILED (cmp_all(1))108Testing: ntlmv2-opencl, NTLMv2 C/R [MD4 HMAC-MD5 OpenCL]... FAILED (cmp_one(0))109Testing: pgpdisk-opencl [SHA1 OpenCL]... (8xOMP) FAILED (cmp_all(3))110Testing: pgpwde-opencl [SHA1 AES OpenCL]... FAILED (cmp_all(1))111Testing: Raw-SHA512-free-opencl [SHA512 OpenCL (inefficient, development use mostly)]... FAILED (cmp_all(1))112Testing: Raw-SHA512-opencl [SHA512 OpenCL]... FAILED (cmp_one(0))113Testing: wpapsk-opencl, WPA/WPA2/PMF PSK [PBKDF2-SHA1 OpenCL]... FAILED (cmp_all(7))114Testing: wpapsk-pmk-opencl, WPA/WPA2/PMF master key [MD5/SHA-1/SHA-2 OpenCL]... FAILED (cmp_all(3))115Testing: XSHA512-free-opencl, Mac OS X 10.7+ [SHA512 OpenCL (efficient at ""many salts"" only)]... FAILED (cmp_all(1))116Testing: XSHA512-opencl, Mac OS X 10.7 salted [SHA512 OpenCL]... FAILED (cmp_one(0))117```118 119The Intel GPU and Intel CPU devices passes all self-tests (see #3245).",1,opencl formats failing on macos with amd radeon pro     this is a hopeless opencl runtime  just like the macos nvidia one   see also        note that this list does not show the    formats that do work fine ๐Ÿ˜†        device    amd radeon pro   compute engine  testing    opencl  crypt         rounds         failed  cmp all      testing  descrypt opencl  traditional crypt         options used   i  users magnum src john run kernels  cl mad enable  d  os x    d  gpu    ddevice info    dsizeof size t    ddev ver major    ddev ver minor    d opencl compiler  d work group size    d use local mem    john kernels des bs kernel cl  build log  error returned by cvms element build from source  error    building kernel  john kernels des bs kernel cl  device info    opencl cl build program failure      error in opencl common c     clbuildprogram failed             testing  geli opencl  freebsd geli      failed  cmp all      testing  keyring opencl  gnome keyring      failed  cmp all      testing      opencl  kerberos   as req pre auth etype        failed  cmp one      testing      opencl  kerberos   as req pre auth etype          failed  cmp all      testing    opencl    c r      failed  cmp one      testing  pgpdisk opencl          failed  cmp all      testing  pgpwde opencl      failed  cmp all      testing  raw   free opencl      failed  cmp all      testing  raw   opencl      failed  cmp one      testing  wpapsk opencl  wpa   pmf psk      failed  cmp all      testing  wpapsk pmk opencl  wpa   pmf master key      failed  cmp all      testing    free opencl  mac os x           failed  cmp all      testing    opencl  mac os x     salted      failed  cmp one             the intel gpu and intel cpu devices passes all self tests  see     ,1120605,8165759358.0,IssuesEvent,2018-08-25 00:05:47,magnumripper/JohnTheRipper,https://api.github.com/repos/magnumripper/JohnTheRipper,closed,OpenCL-enabled PMKID attack fails to run,portability,"I installed JtR from this repo on the lastest Kali. When running the PMKID attack, I get:121```122$  ./run/john -mask=?d?d?d?d?d?d?d?d --dev=gpu --format=wpapsk-pmk-opencl pmkid-test123Device 1: Baffin [Radeon RX 560 Series]124Using default input encoding: UTF-8125Loaded 87 password hashes with 87 different salts (wpapsk-pmk-opencl, WPA/WPA2/PMF/PMKID master key [MD5/SHA-1/SHA-2 OpenCL])126Cost 1 (key version [0:PMKID 1:WPA 2:WPA2 3:802.11w]) is 0 for all loaded hashes127Options used: -I /home/user/JohnTheRipper/run/kernels -cl-mad-enable -D__GPU__ -DDEVICE_INFO=522 -DSIZEOF_SIZE_T=8 -DDEV_VER_MAJOR=2633 -DDEV_VER_MINOR=3 -D_OPENCL_COMPILER -DPLAINTEXT_LENGTH=64 -DV_WIDTH=1 -DWPAPMK $JOHN/kernels/wpapsk_kernel.cl128Build log: In file included from /tmp/OCL7202T3.cl:13:129In file included from /home/user/JohnTheRipper/run/kernels/opencl_cmac.h:24:130/home/user/JohnTheRipper/run/kernels/opencl_aes.h:316:4: error: unsupported: typedef changes linkage of anonymous type, but linkage was already computed131        } aes_block_t;132          ^133/home/user/JohnTheRipper/run/kernels/opencl_aes.h:313:15: note: use a tag name here to establish linkage prior to definition134        typedef union {135                     ^136                      aes_block_t1371 error generated.138 139error: Clang front-end compilation failed!140Frontend phase failed compilation.141Error: Compiling CL to IR142 143Error -11 building kernel $JOHN/kernels/wpapsk_kernel.cl. DEVICE_INFO=522144OpenCL CL_BUILD_PROGRAM_FAILURE (-11) error in opencl_common.c:1177 - clBuildProgram failed.145```146",True,"OpenCL-enabled PMKID attack fails to run - I installed JtR from this repo on the lastest Kali. When running the PMKID attack, I get:147```148$  ./run/john -mask=?d?d?d?d?d?d?d?d --dev=gpu --format=wpapsk-pmk-opencl pmkid-test149Device 1: Baffin [Radeon RX 560 Series]150Using default input encoding: UTF-8151Loaded 87 password hashes with 87 different salts (wpapsk-pmk-opencl, WPA/WPA2/PMF/PMKID master key [MD5/SHA-1/SHA-2 OpenCL])152Cost 1 (key version [0:PMKID 1:WPA 2:WPA2 3:802.11w]) is 0 for all loaded hashes153Options used: -I /home/user/JohnTheRipper/run/kernels -cl-mad-enable -D__GPU__ -DDEVICE_INFO=522 -DSIZEOF_SIZE_T=8 -DDEV_VER_MAJOR=2633 -DDEV_VER_MINOR=3 -D_OPENCL_COMPILER -DPLAINTEXT_LENGTH=64 -DV_WIDTH=1 -DWPAPMK $JOHN/kernels/wpapsk_kernel.cl154Build log: In file included from /tmp/OCL7202T3.cl:13:155In file included from /home/user/JohnTheRipper/run/kernels/opencl_cmac.h:24:156/home/user/JohnTheRipper/run/kernels/opencl_aes.h:316:4: error: unsupported: typedef changes linkage of anonymous type, but linkage was already computed157        } aes_block_t;158          ^159/home/user/JohnTheRipper/run/kernels/opencl_aes.h:313:15: note: use a tag name here to establish linkage prior to definition160        typedef union {161                     ^162                      aes_block_t1631 error generated.164 165error: Clang front-end compilation failed!166Frontend phase failed compilation.167Error: Compiling CL to IR168 169Error -11 building kernel $JOHN/kernels/wpapsk_kernel.cl. DEVICE_INFO=522170OpenCL CL_BUILD_PROGRAM_FAILURE (-11) error in opencl_common.c:1177 - clBuildProgram failed.171```172",1,opencl enabled pmkid attack fails to run   i installed jtr from this repo on the lastest kali  when running the pmkid attack  i get             run john  mask  d d d d d d d d   dev gpu   format wpapsk pmk opencl pmkid test  device    baffin    using default input encoding  utf    loaded   password hashes with   different salts  wpapsk pmk opencl  wpa   pmf pmkid master key     cost    key version    is   for all loaded hashes  options used   i  home user johntheripper run kernels  cl mad enable  d  gpu    ddevice info    dsizeof size t    ddev ver major    ddev ver minor    d opencl compiler  dplaintext length    dv width    dwpapmk  john kernels wpapsk kernel cl  build log  in file included from  tmp   cl     in file included from  home user johntheripper run kernels opencl cmac h      home user johntheripper run kernels opencl aes h      error  unsupported  typedef changes linkage of anonymous type  but linkage was already computed            aes block t                 home user johntheripper run kernels opencl aes h      note  use a tag name here to establish linkage prior to definition          typedef union                                                  aes block t    error generated     error  clang front end compilation failed   frontend phase failed compilation   error  compiling cl to ir    error    building kernel  john kernels wpapsk kernel cl  device info    opencl cl build program failure      error in opencl common c     clbuildprogram failed        ,1173100,3171838158.0,IssuesEvent,2015-09-23 01:45:59,magnumripper/JohnTheRipper,https://api.github.com/repos/magnumripper/JohnTheRipper,reopened,oldoffice-opencl fails self test on super (Catalyst 15.5 & 15.7),portability,"```174$ ./john --test=0 --format=oldoffice-opencl175./john: /usr/local/cuda/lib64/libOpenCL.so.1: no version information available (required by ./john)176./john: /usr/local/cuda/lib64/libOpenCL.so.1: no version information available (required by ./john)177Device 0: Tahiti [AMD Radeon HD 7900 Series]178Testing: oldoffice-opencl, MS Office <= 2003 [MD5/SHA1 RC4 OpenCL]... FAILED (cmp_all(1))179 180```",True,"oldoffice-opencl fails self test on super (Catalyst 15.5 & 15.7) - ```181$ ./john --test=0 --format=oldoffice-opencl182./john: /usr/local/cuda/lib64/libOpenCL.so.1: no version information available (required by ./john)183./john: /usr/local/cuda/lib64/libOpenCL.so.1: no version information available (required by ./john)184Device 0: Tahiti [AMD Radeon HD 7900 Series]185Testing: oldoffice-opencl, MS Office <= 2003 [MD5/SHA1 RC4 OpenCL]... FAILED (cmp_all(1))186 187```",1,oldoffice opencl fails self test on super  catalyst                       john   test     format oldoffice opencl    john   usr local cuda   libopencl so    no version information available  required by   john     john   usr local cuda   libopencl so    no version information available  required by   john   device    tahiti    testing  oldoffice opencl  ms office           failed  cmp all           ,1188667,8759840093.0,IssuesEvent,2018-12-15 20:40:36,magnumripper/JohnTheRipper,https://api.github.com/repos/magnumripper/JohnTheRipper,closed,compile failure on OS X and for MIC,portability,"on OS X:189 190```191Undefined symbols for architecture x86_64:192  ""_AES_cbc_encrypt"", referenced from:193      _sevenzip_decrypt in 7z_fmt_plug.o194      ...195  ""_AES_cfb128_encrypt"", referenced from:196      _crypt_all in gpg_fmt_plug.o197      _crypt_all in opencl_gpg_fmt_plug.o198  ""_AES_decrypt"", referenced from:199      _crypt_all in openbsdsoftraid_fmt_plug.o200      _AES_256_XTS_first_sector in truecrypt_fmt_plug.o201...202```203 204`-lssl -lcrypto` is somehow missed in the build rule for john:205 206```207../run/john: $(JOHN_OBJS) aes/aes.a208    $(LD) $(JOHN_OBJS) $(LDFLAGS)    -lgmp    -Wl,-framework,OpenCL  -lm -D_THREAD_SAFE -pthread  -lm -lz -ldl  -lbz2 aes/aes.a -o ../run/john209```210 211for MIC:212 213```214icc -mmic -DAC_BUILT -Wall -O3  -D_POSIX_SOURCE -D_GNU_SOURCE -D_XOPEN_SOURCE=600  -DNOT_JOHN -D_JOHN_MISC_NO_LOG cprepair.c unicode.c \215        misc.c memdbg.c -o ../run/cprepair216In file included from unicode.c(85):217md4.h(14): catastrophic error: cannot open source file ""openssl/md4.h""218  #include <openssl/md4.h>219```220 221The build rule for `cprepair` should include CPPFLAGS.222",True,"compile failure on OS X and for MIC - on OS X:223 224```225Undefined symbols for architecture x86_64:226  ""_AES_cbc_encrypt"", referenced from:227      _sevenzip_decrypt in 7z_fmt_plug.o228      ...229  ""_AES_cfb128_encrypt"", referenced from:230      _crypt_all in gpg_fmt_plug.o231      _crypt_all in opencl_gpg_fmt_plug.o232  ""_AES_decrypt"", referenced from:233      _crypt_all in openbsdsoftraid_fmt_plug.o234      _AES_256_XTS_first_sector in truecrypt_fmt_plug.o235...236```237 238`-lssl -lcrypto` is somehow missed in the build rule for john:239 240```241../run/john: $(JOHN_OBJS) aes/aes.a242    $(LD) $(JOHN_OBJS) $(LDFLAGS)    -lgmp    -Wl,-framework,OpenCL  -lm -D_THREAD_SAFE -pthread  -lm -lz -ldl  -lbz2 aes/aes.a -o ../run/john243```244 245for MIC:246 247```248icc -mmic -DAC_BUILT -Wall -O3  -D_POSIX_SOURCE -D_GNU_SOURCE -D_XOPEN_SOURCE=600  -DNOT_JOHN -D_JOHN_MISC_NO_LOG cprepair.c unicode.c \249        misc.c memdbg.c -o ../run/cprepair250In file included from unicode.c(85):251md4.h(14): catastrophic error: cannot open source file ""openssl/md4.h""252  #include <openssl/md4.h>253```254 255The build rule for `cprepair` should include CPPFLAGS.256",1,compile failure on os x and for mic   on os x       undefined symbols for architecture          aes cbc encrypt   referenced from         sevenzip decrypt in   fmt plug o               aes   encrypt   referenced from         crypt all in gpg fmt plug o        crypt all in opencl gpg fmt plug o     aes decrypt   referenced from         crypt all in openbsdsoftraid fmt plug o        aes   xts first sector in truecrypt fmt plug o            lssl  lcrypto  is somehow missed in the build rule for john          run john    john objs  aes aes a       ld    john objs    ldflags      lgmp     wl  framework opencl   lm  d thread safe  pthread   lm  lz  ldl     aes aes a  o    run john      for mic       icc  mmic  dac built  wall      d posix source  d gnu source  d xopen source     dnot john  d john misc no log cprepair c unicode c           misc c memdbg c  o    run cprepair in file included from unicode c       h     catastrophic error  cannot open source file  openssl   h     include        the build rule for  cprepair  should include cppflags  ,125798323,29735429824.0,IssuesEvent,2023-06-14 00:10:27,jqlang/jq,https://api.github.com/repos/jqlang/jq,closed,Make fails on Ubuntu 18.04,build,"`./.libs/libjq.a(builtin.o): In function `f_pow10':258/home/daadmin/StdUtils/jq/src/libm.h:253: undefined reference to `pow10'259collect2: error: ld returned 1 exit status260Makefile:984: recipe for target 'jq' failed261make[2]: *** [jq] Error 1262make[2]: Leaving directory '/home/daadmin/StdUtils/jq'263Makefile:1148: recipe for target 'all-recursive' failed264make[1]: *** [all-recursive] Error 1265make[1]: Leaving directory '/home/daadmin/StdUtils/jq'266Makefile:825: recipe for target 'all' failed267make: *** [all] Error 2268`269Is this the same issue as #1565 ??",1.0,"Make fails on Ubuntu 18.04 - `./.libs/libjq.a(builtin.o): In function `f_pow10':270/home/daadmin/StdUtils/jq/src/libm.h:253: undefined reference to `pow10'271collect2: error: ld returned 1 exit status272Makefile:984: recipe for target 'jq' failed273make[2]: *** [jq] Error 1274make[2]: Leaving directory '/home/daadmin/StdUtils/jq'275Makefile:1148: recipe for target 'all-recursive' failed276make[1]: *** [all-recursive] Error 1277make[1]: Leaving directory '/home/daadmin/StdUtils/jq'278Makefile:825: recipe for target 'all' failed279make: *** [all] Error 2280`281Is this the same issue as #1565 ??",0,make fails on ubuntu           libs libjq a builtin o   in function  f       home daadmin stdutils jq src libm h    undefined reference to         error  ld returned   exit status  makefile    recipe for target  jq  failed  make         error    make   leaving directory   home daadmin stdutils jq   makefile    recipe for target  all recursive  failed  make         error    make   leaving directory   home daadmin stdutils jq   makefile    recipe for target  all  failed  make        error       is this the same issue as      ,0282159,3737636426.0,IssuesEvent,2016-03-08 19:58:05,magnumripper/JohnTheRipper,https://api.github.com/repos/magnumripper/JohnTheRipper,closed,Crash recovery file is locked,portability,"I've compiled john on cygwin (x64).  When i run john with the --fork option, the process doesnt seem to cleanly exit if 2831) i have killed the session using Ctrl-C or 2842) John completes the iteration 285 286and as a result the crash files arent removed. This is a bit annoying when you have john running from a bash script287 288Im running 289john.exe hashes.txt  --format=lm  --mask=?u?u?u?u?d?d?d --session=SSSF ; stty sane290 291its running fine without the fork option292 293 294 295John version:296$ ./john.exe297John the Ripper 1.8.0.6-jumbo-1-2087-g35996d5+ OMP [cygwin 64-bit AVX2-ac]298",True,"Crash recovery file is locked - I've compiled john on cygwin (x64).  When i run john with the --fork option, the process doesnt seem to cleanly exit if 2991) i have killed the session using Ctrl-C or 3002) John completes the iteration 301 302and as a result the crash files arent removed. This is a bit annoying when you have john running from a bash script303 304Im running 305john.exe hashes.txt  --format=lm  --mask=?u?u?u?u?d?d?d --session=SSSF ; stty sane306 307its running fine without the fork option308 309 310 311John version:312$ ./john.exe313John the Ripper 1.8.0.6-jumbo-1-2087-g35996d5+ OMP [cygwin 64-bit AVX2-ac]314",1,crash recovery file is locked   i ve compiled john on cygwin       when i run john with the   fork option  the process doesnt seem to cleanly exit if      i have killed the session using ctrl c or      john completes the iteration     and as a result the crash files arent removed  this is a bit annoying when you have john running from a bash script    im running   john exe hashes txt    format lm    mask  u u u u d d d   session sssf   stty sane    its running fine without the fork option        john version       john exe  john the ripper         jumbo        omp    ,1315115691,11885171856.0,IssuesEvent,2020-03-27 19:03:34,fabricio-garcia/pongon-a-virus,https://api.github.com/repos/fabricio-garcia/pongon-a-virus,opened,Scoring System,documentation enhancement,"- [ ] You must implement a **scoring system**, so that when the user completes a game they are given a score (number)316 317- [ ] You should [use this service API](https://www.notion.so/microverse/Leaderboard-API-service-24c0c3c116974ac49488d4eb0267ade3) to save the score associated to the game and the user name, and display a leaderboard (as a Phaser scene)",1.0,"Scoring System - - [ ] You must implement a **scoring system**, so that when the user completes a game they are given a score (number)318 319- [ ] You should [use this service API](https://www.notion.so/microverse/Leaderboard-API-service-24c0c3c116974ac49488d4eb0267ade3) to save the score associated to the game and the user name, and display a leaderboard (as a Phaser scene)",0,scoring system       you must implement a   scoring system    so that when the user completes a game they are given a score  number         you should     to save the score associated to the game and the user name  and display a leaderboard  as a phaser scene ,0320220,4615335972.0,IssuesEvent,2016-09-26 01:35:50,magnumripper/JohnTheRipper,https://api.github.com/repos/magnumripper/JohnTheRipper,closed,OSX compilation issues post sierra,portability,"Recently home-brew quit allowing users to link brewโ€™s openssl headers with the system install of openssl (which as of Sierra is still OpenSSL 0.9.8zh 14 Jan 2016.  321 322Attempting to force link the two fails with the following error:323 324Ultrons-MacBook-Pro:src Ultron$ brew link openssl --force325Warning: Refusing to link: openssl326Linking keg-only openssl means you may end up linking against the insecure,327deprecated system OpenSSL while using the headers from Homebrew's openssl.328Instead, pass the full include/library paths to your compiler e.g.:329  -I/usr/local/opt/openssl/include -L/usr/local/opt/openssl/lib330 331Unfortunately the developers of brew show absolutely no sign of changing their minds on this problem as can be seen in the following threads:332 333https://github.com/Homebrew/brew/issues/891334https://langui.sh/2015/07/24/osx-clang-include-lib-search-paths/335 336Of course this means that compiling JTR fails with the following error:337 338configure: error: in `/Users/ultron/Desktop/JohnTheRipper/src':339configure: error: JtR requires OpenSSL headers being installed340 341In order to correct this error, I have pulled openssl from source and compiled it locally on my desktop, and attempted to point the configure file at that install by invoking the following command:342 343./configure OPENSSL_CFLAGS=""-I /usr/local/opt/openssl/include -L /usr/local/opt/openssl/lib""344 345Fortunately, the makefile build succeeds and prompts me to build the package with make clean && make -s.  346 347Make clean of course succeeds, but make -s fails.  348 349gpg2john.c:418:14: warning: comparison of constant -1 with expression of type 'unsigned char' is always false [-Wtautological-constant-out-of-range-compare]350                if (buf[i] == EOF)351                    ~~~~~~ ^  ~~~3521 warning generated.353ar: creating archive aes.a354clang: warning: argument unused during compilation: '-pthread'355Undefined symbols for architecture x86_64:356  ""_Camellia_cfb128_encrypt"", referenced from:357      _gpg_common_check in gpg_common_plug.o358  ""_Camellia_set_key"", referenced from:359      _gpg_common_check in gpg_common_plug.o360  ""_WHIRLPOOL_Final"", referenced from:361      _get_salt in dynamic_fmt.o362      _DynamicFunc__WHIRLPOOL_crypt_input1_append_input2 in dynamic_big_crypt.o363      _DynamicFunc__WHIRLPOOL_crypt_input2_append_input1 in dynamic_big_crypt.o364      _DynamicFunc__WHIRLPOOL_crypt_input1_at_offset_input2 in dynamic_big_crypt.o365      _DynamicFunc__WHIRLPOOL_crypt_input2_at_offset_input1 in dynamic_big_crypt.o366      _DynamicFunc__WHIRLPOOL_crypt_input1_at_offset_input1 in dynamic_big_crypt.o367      _DynamicFunc__WHIRLPOOL_crypt_input2_at_offset_input2 in dynamic_big_crypt.o368      ...369  ""_WHIRLPOOL_Init"", referenced from:370      _get_salt in dynamic_fmt.o371      _DynamicFunc__WHIRLPOOL_crypt_input1_append_input2 in dynamic_big_crypt.o372      _DynamicFunc__WHIRLPOOL_crypt_input2_append_input1 in dynamic_big_crypt.o373      _DynamicFunc__WHIRLPOOL_crypt_input1_at_offset_input2 in dynamic_big_crypt.o374      _DynamicFunc__WHIRLPOOL_crypt_input2_at_offset_input1 in dynamic_big_crypt.o375      _DynamicFunc__WHIRLPOOL_crypt_input1_at_offset_input1 in dynamic_big_crypt.o376      _DynamicFunc__WHIRLPOOL_crypt_input2_at_offset_input2 in dynamic_big_crypt.o377      ...378  ""_WHIRLPOOL_Update"", referenced from:379      _get_salt in dynamic_fmt.o380      _DynamicFunc__WHIRLPOOL_crypt_input1_append_input2 in dynamic_big_crypt.o381      _DynamicFunc__WHIRLPOOL_crypt_input2_append_input1 in dynamic_big_crypt.o382      _DynamicFunc__WHIRLPOOL_crypt_input1_at_offset_input2 in dynamic_big_crypt.o383      _DynamicFunc__WHIRLPOOL_crypt_input2_at_offset_input1 in dynamic_big_crypt.o384      _DynamicFunc__WHIRLPOOL_crypt_input1_at_offset_input1 in dynamic_big_crypt.o385      _DynamicFunc__WHIRLPOOL_crypt_input2_at_offset_input2 in dynamic_big_crypt.o386      ...387ld: symbol(s) not found for architecture x86_64388clang: error: linker command failed with exit code 1 (use -v to see invocation)389make[1]: *** [../run/john] Error 1390make: *** [default] Error 2391 392Any help in resolving this issue?",True,"OSX compilation issues post sierra - Recently home-brew quit allowing users to link brewโ€™s openssl headers with the system install of openssl (which as of Sierra is still OpenSSL 0.9.8zh 14 Jan 2016.  393 394Attempting to force link the two fails with the following error:395 396Ultrons-MacBook-Pro:src Ultron$ brew link openssl --force397Warning: Refusing to link: openssl398Linking keg-only openssl means you may end up linking against the insecure,399deprecated system OpenSSL while using the headers from Homebrew's openssl.400Instead, pass the full include/library paths to your compiler e.g.:401  -I/usr/local/opt/openssl/include -L/usr/local/opt/openssl/lib402 403Unfortunately the developers of brew show absolutely no sign of changing their minds on this problem as can be seen in the following threads:404 405https://github.com/Homebrew/brew/issues/891406https://langui.sh/2015/07/24/osx-clang-include-lib-search-paths/407 408Of course this means that compiling JTR fails with the following error:409 410configure: error: in `/Users/ultron/Desktop/JohnTheRipper/src':411configure: error: JtR requires OpenSSL headers being installed412 413In order to correct this error, I have pulled openssl from source and compiled it locally on my desktop, and attempted to point the configure file at that install by invoking the following command:414 415./configure OPENSSL_CFLAGS=""-I /usr/local/opt/openssl/include -L /usr/local/opt/openssl/lib""416 417Fortunately, the makefile build succeeds and prompts me to build the package with make clean && make -s.  418 419Make clean of course succeeds, but make -s fails.  420 421gpg2john.c:418:14: warning: comparison of constant -1 with expression of type 'unsigned char' is always false [-Wtautological-constant-out-of-range-compare]422                if (buf[i] == EOF)423                    ~~~~~~ ^  ~~~4241 warning generated.425ar: creating archive aes.a426clang: warning: argument unused during compilation: '-pthread'427Undefined symbols for architecture x86_64:428  ""_Camellia_cfb128_encrypt"", referenced from:429      _gpg_common_check in gpg_common_plug.o430  ""_Camellia_set_key"", referenced from:431      _gpg_common_check in gpg_common_plug.o432  ""_WHIRLPOOL_Final"", referenced from:433      _get_salt in dynamic_fmt.o434      _DynamicFunc__WHIRLPOOL_crypt_input1_append_input2 in dynamic_big_crypt.o435      _DynamicFunc__WHIRLPOOL_crypt_input2_append_input1 in dynamic_big_crypt.o436      _DynamicFunc__WHIRLPOOL_crypt_input1_at_offset_input2 in dynamic_big_crypt.o437      _DynamicFunc__WHIRLPOOL_crypt_input2_at_offset_input1 in dynamic_big_crypt.o438      _DynamicFunc__WHIRLPOOL_crypt_input1_at_offset_input1 in dynamic_big_crypt.o439      _DynamicFunc__WHIRLPOOL_crypt_input2_at_offset_input2 in dynamic_big_crypt.o440      ...441  ""_WHIRLPOOL_Init"", referenced from:442      _get_salt in dynamic_fmt.o443      _DynamicFunc__WHIRLPOOL_crypt_input1_append_input2 in dynamic_big_crypt.o444      _DynamicFunc__WHIRLPOOL_crypt_input2_append_input1 in dynamic_big_crypt.o445      _DynamicFunc__WHIRLPOOL_crypt_input1_at_offset_input2 in dynamic_big_crypt.o446      _DynamicFunc__WHIRLPOOL_crypt_input2_at_offset_input1 in dynamic_big_crypt.o447      _DynamicFunc__WHIRLPOOL_crypt_input1_at_offset_input1 in dynamic_big_crypt.o448      _DynamicFunc__WHIRLPOOL_crypt_input2_at_offset_input2 in dynamic_big_crypt.o449      ...450  ""_WHIRLPOOL_Update"", referenced from:451      _get_salt in dynamic_fmt.o452      _DynamicFunc__WHIRLPOOL_crypt_input1_append_input2 in dynamic_big_crypt.o453      _DynamicFunc__WHIRLPOOL_crypt_input2_append_input1 in dynamic_big_crypt.o454      _DynamicFunc__WHIRLPOOL_crypt_input1_at_offset_input2 in dynamic_big_crypt.o455      _DynamicFunc__WHIRLPOOL_crypt_input2_at_offset_input1 in dynamic_big_crypt.o456      _DynamicFunc__WHIRLPOOL_crypt_input1_at_offset_input1 in dynamic_big_crypt.o457      _DynamicFunc__WHIRLPOOL_crypt_input2_at_offset_input2 in dynamic_big_crypt.o458      ...459ld: symbol(s) not found for architecture x86_64460clang: error: linker command failed with exit code 1 (use -v to see invocation)461make[1]: *** [../run/john] Error 1462make: *** [default] Error 2463 464Any help in resolving this issue?",1,osx compilation issues post sierra   recently home brew quit allowing users to link brewโ€™s openssl headers with the system install of openssl  which as of sierra is still openssl         jan         attempting to force link the two fails with the following error     ultrons macbook pro src ultron  brew link openssl   force  warning  refusing to link  openssl  linking keg only openssl means you may end up linking against the insecure   deprecated system openssl while using the headers from homebrew s openssl   instead  pass the full include library paths to your compiler e g       i usr local opt openssl include  l usr local opt openssl lib    unfortunately the developers of brew show absolutely no sign of changing their minds on this problem as can be seen in the following threads             of course this means that compiling jtr fails with the following error     configure  error  in   users ultron desktop johntheripper src    configure  error  jtr requires openssl headers being installed    in order to correct this error  i have pulled openssl from source and compiled it locally on my desktop  and attempted to point the configure file at that install by invoking the following command       configure openssl cflags   i  usr local opt openssl include  l  usr local opt openssl lib     fortunately  the makefile build succeeds and prompts me to build the package with make clean    make  s       make clean of course succeeds  but make  s fails         c      warning  comparison of constant    with expression of type  unsigned char  is always false                    if  buf     eof                                        warning generated   ar  creating archive aes a  clang  warning  argument unused during compilation    pthread   undefined symbols for architecture           camellia   encrypt   referenced from          gpg common check in gpg common plug o      camellia set key   referenced from          gpg common check in gpg common plug o      whirlpool final   referenced from          get salt in dynamic fmt o         dynamicfunc  whirlpool crypt   append   in dynamic big crypt o         dynamicfunc  whirlpool crypt   append   in dynamic big crypt o         dynamicfunc  whirlpool crypt   at offset   in dynamic big crypt o         dynamicfunc  whirlpool crypt   at offset   in dynamic big crypt o         dynamicfunc  whirlpool crypt   at offset   in dynamic big crypt o         dynamicfunc  whirlpool crypt   at offset   in dynamic big crypt o                 whirlpool init   referenced from          get salt in dynamic fmt o         dynamicfunc  whirlpool crypt   append   in dynamic big crypt o         dynamicfunc  whirlpool crypt   append   in dynamic big crypt o         dynamicfunc  whirlpool crypt   at offset   in dynamic big crypt o         dynamicfunc  whirlpool crypt   at offset   in dynamic big crypt o         dynamicfunc  whirlpool crypt   at offset   in dynamic big crypt o         dynamicfunc  whirlpool crypt   at offset   in dynamic big crypt o                 whirlpool update   referenced from          get salt in dynamic fmt o         dynamicfunc  whirlpool crypt   append   in dynamic big crypt o         dynamicfunc  whirlpool crypt   append   in dynamic big crypt o         dynamicfunc  whirlpool crypt   at offset   in dynamic big crypt o         dynamicfunc  whirlpool crypt   at offset   in dynamic big crypt o         dynamicfunc  whirlpool crypt   at offset   in dynamic big crypt o         dynamicfunc  whirlpool crypt   at offset   in dynamic big crypt o             ld  symbol s  not found for architecture      clang  error  linker command failed with exit code    use  v to see invocation   make         error    make        error      any help in resolving this issue ,1465125,3407484893.0,IssuesEvent,2015-12-04 03:14:19,magnumripper/JohnTheRipper,https://api.github.com/repos/magnumripper/JohnTheRipper,closed,Python helpers overhaul,portability,"Quoting @psypanda in https://github.com/magnumripper/JohnTheRipper/pull/1056#issuecomment-74917401466> Please also note that some python scripts still use the [deprecated optparse ](https://docs.python.org/2/library/optparse.html) for parsing command line options. It might be a good idea to move from optparse to [argparse](https://docs.python.org/2.7/library/argparse.html) in the near future.467Here is a list of .py files that still got optparse code in them:468* aix2john.py469* bitcoin2john.py470* blockchain2john.py471* efs2john.py472* openssl2john.py473 474",True,"Python helpers overhaul - Quoting @psypanda in https://github.com/magnumripper/JohnTheRipper/pull/1056#issuecomment-74917401475> Please also note that some python scripts still use the [deprecated optparse ](https://docs.python.org/2/library/optparse.html) for parsing command line options. It might be a good idea to move from optparse to [argparse](https://docs.python.org/2.7/library/argparse.html) in the near future.476Here is a list of .py files that still got optparse code in them:477* aix2john.py478* bitcoin2john.py479* blockchain2john.py480* efs2john.py481* openssl2john.py482 483",1,python helpers overhaul   quoting  psypanda in      please also note that some python scripts still use the     for parsing command line options  it might be a good idea to move from optparse to     in the near future   here is a list of  py files that still got optparse code in them       py      py      py      py      py    ,148459,2914117179.0,IssuesEvent,2015-06-23 01:16:56,magnumripper/JohnTheRipper,https://api.github.com/repos/magnumripper/JohnTheRipper,closed,PBKDF2-HMAC-SHA512-opencl fails on OSX,portability,"These are driver bugs, but I'll see if I can work around them. CPU device works fine but HD4000 and GT650M fails *building*.485```486Device 2: GeForce GT 650M487Options used: -I ../run/kernels -cl-mad-enable -DAPPLE -DDEVICE_INFO=18 -D_OPENCL_COMPILER -DDEV_VER_MAJOR=10 -DDEV_VER_MINOR=2 -DHASH_LOOPS=250 -DPLAINTEXT_LENGTH=110 -DMAX_SALT_SIZE=107488Build log: Error getting function data from server489Error -11 building kernel $JOHN/kernels/pbkdf2_hmac_sha512_kernel.cl. DEVICE_INFO=18490OpenCL error (CL_BUILD_PROGRAM_FAILURE) in file (common-opencl.c) at line (964) - (clBuildProgram failed.)491 492Device 1: HD Graphics 4000493Options used: -I ../run/kernels -cl-mad-enable -DAPPLE -DDEVICE_INFO=34 -D_OPENCL_COMPILER -DDEV_VER_MAJOR=1 -DDEV_VER_MINOR=2 -DHASH_LOOPS=250 -DPLAINTEXT_LENGTH=110 -DMAX_SALT_SIZE=107494Build log: Error: internal error.495 496Error -11 building kernel $JOHN/kernels/pbkdf2_hmac_sha512_kernel.cl. DEVICE_INFO=34497OpenCL error (CL_BUILD_PROGRAM_FAILURE) in file (common-opencl.c) at line (964) - (clBuildProgram failed.)498```",True,"PBKDF2-HMAC-SHA512-opencl fails on OSX - These are driver bugs, but I'll see if I can work around them. CPU device works fine but HD4000 and GT650M fails *building*.499```500Device 2: GeForce GT 650M501Options used: -I ../run/kernels -cl-mad-enable -DAPPLE -DDEVICE_INFO=18 -D_OPENCL_COMPILER -DDEV_VER_MAJOR=10 -DDEV_VER_MINOR=2 -DHASH_LOOPS=250 -DPLAINTEXT_LENGTH=110 -DMAX_SALT_SIZE=107502Build log: Error getting function data from server503Error -11 building kernel $JOHN/kernels/pbkdf2_hmac_sha512_kernel.cl. DEVICE_INFO=18504OpenCL error (CL_BUILD_PROGRAM_FAILURE) in file (common-opencl.c) at line (964) - (clBuildProgram failed.)505 506Device 1: HD Graphics 4000507Options used: -I ../run/kernels -cl-mad-enable -DAPPLE -DDEVICE_INFO=34 -D_OPENCL_COMPILER -DDEV_VER_MAJOR=1 -DDEV_VER_MINOR=2 -DHASH_LOOPS=250 -DPLAINTEXT_LENGTH=110 -DMAX_SALT_SIZE=107508Build log: Error: internal error.509 510Error -11 building kernel $JOHN/kernels/pbkdf2_hmac_sha512_kernel.cl. DEVICE_INFO=34511OpenCL error (CL_BUILD_PROGRAM_FAILURE) in file (common-opencl.c) at line (964) - (clBuildProgram failed.)512```",1,  hmac   opencl fails on osx   these are driver bugs  but i ll see if i can work around them  cpu device works fine but   and   fails  building         device    geforce gt    options used   i    run kernels  cl mad enable  dapple  ddevice info    d opencl compiler  ddev ver major    ddev ver minor    dhash loops    dplaintext length    dmax salt size    build log  error getting function data from server  error    building kernel  john kernels   hmac   kernel cl  device info    opencl error  cl build program failure  in file  common opencl c  at line        clbuildprogram failed      device    hd graphics    options used   i    run kernels  cl mad enable  dapple  ddevice info    d opencl compiler  ddev ver major    ddev ver minor    dhash loops    dplaintext length    dmax salt size    build log  error  internal error     error    building kernel  john kernels   hmac   kernel cl  device info    opencl error  cl build program failure  in file  common opencl c  at line        clbuildprogram failed       ,1513266,5201757475.0,IssuesEvent,2017-01-24 06:39:47,magnumripper/JohnTheRipper,https://api.github.com/repos/magnumripper/JohnTheRipper,closed,latest windows build JtR-MinGW-3b8c5b3.zip --> 0xc0000142,portability,"Today I tried to get any pre-compiled windows version of JtR from http://www.openwall.com/john/ running on my Windows 10 x64 but I got always error messages (e.g. `Couldn't compute FAST_CWD pointer`). Trying to build any 1.7.9-jumbo or 1.8.0-jumbo also failed with missing symbol `MD5_body_for_thread` during linking . So I decided to use the latest build from Download section in `Readme.md` of https://github.com/magnumripper/JohnTheRipper/tree/bleeding-jumbo. After decrompression of JtR-MinGW-3b8c5b3.zip I tried to generate a hash file using following command:514`zip2john.exe d:\__HDD_saving\HDD3\privat.zip > d:\zip.hashes`515 516But all I got is an error message box complaining about an execution error 0xc0000142.517 518Here is the windows event log:519 520```521- <Event xmlns=""http://schemas.microsoft.com/win/2004/08/events/event"">522- <System>523  <Provider Name=""Application Error"" /> 524  <EventID Qualifiers=""0"">1000</EventID> 525  <Level>2</Level> 526  <Task>100</Task> 527  <Keywords>0x80000000000000</Keywords> 528  <TimeCreated SystemTime=""2016-03-10T18:07:48.166545900Z"" /> 529  <EventRecordID>4797</EventRecordID> 530  <Channel>Application</Channel> 531  <Computer>KiSchwa-PC</Computer> 532  <Security /> 533  </System>534- <EventData>535  <Data>john.exe</Data> 536  <Data>0.0.0.0</Data> 537  <Data>00000000</Data> 538  <Data>libwinpthread-1.dll</Data> 539  <Data>1.0.0.0</Data> 540  <Data>8973db78</Data> 541  <Data>c0000005</Data> 542  <Data>0000000000002bbb</Data> 543  <Data>3048</Data> 544  <Data>01d17af7c0c82f06</Data> 545  <Data>d:\JtR-MinGW-3b8c5b3\run\john.exe</Data> 546  <Data>d:\JtR-MinGW-3b8c5b3\run\libwinpthread-1.dll</Data> 547  <Data>3c111a1e-66e8-4741-9425-ad03e112dc18</Data> 548  <Data /> 549  <Data /> 550  </EventData>551  </Event>552```553",True,"latest windows build JtR-MinGW-3b8c5b3.zip --> 0xc0000142 - Today I tried to get any pre-compiled windows version of JtR from http://www.openwall.com/john/ running on my Windows 10 x64 but I got always error messages (e.g. `Couldn't compute FAST_CWD pointer`). Trying to build any 1.7.9-jumbo or 1.8.0-jumbo also failed with missing symbol `MD5_body_for_thread` during linking . So I decided to use the latest build from Download section in `Readme.md` of https://github.com/magnumripper/JohnTheRipper/tree/bleeding-jumbo. After decrompression of JtR-MinGW-3b8c5b3.zip I tried to generate a hash file using following command:554`zip2john.exe d:\__HDD_saving\HDD3\privat.zip > d:\zip.hashes`555 556But all I got is an error message box complaining about an execution error 0xc0000142.557 558Here is the windows event log:559 560```561- <Event xmlns=""http://schemas.microsoft.com/win/2004/08/events/event"">562- <System>563  <Provider Name=""Application Error"" /> 564  <EventID Qualifiers=""0"">1000</EventID> 565  <Level>2</Level> 566  <Task>100</Task> 567  <Keywords>0x80000000000000</Keywords> 568  <TimeCreated SystemTime=""2016-03-10T18:07:48.166545900Z"" /> 569  <EventRecordID>4797</EventRecordID> 570  <Channel>Application</Channel> 571  <Computer>KiSchwa-PC</Computer> 572  <Security /> 573  </System>574- <EventData>575  <Data>john.exe</Data> 576  <Data>0.0.0.0</Data> 577  <Data>00000000</Data> 578  <Data>libwinpthread-1.dll</Data> 579  <Data>1.0.0.0</Data> 580  <Data>8973db78</Data> 581  <Data>c0000005</Data> 582  <Data>0000000000002bbb</Data> 583  <Data>3048</Data> 584  <Data>01d17af7c0c82f06</Data> 585  <Data>d:\JtR-MinGW-3b8c5b3\run\john.exe</Data> 586  <Data>d:\JtR-MinGW-3b8c5b3\run\libwinpthread-1.dll</Data> 587  <Data>3c111a1e-66e8-4741-9425-ad03e112dc18</Data> 588  <Data /> 589  <Data /> 590  </EventData>591  </Event>592```593",1,latest windows build jtr mingw   zip         today i tried to get any pre compiled windows version of jtr from   running on my windows     but i got always error messages  e g   couldn t compute fast cwd pointer    trying to build any       jumbo or       jumbo also failed with missing symbol    body for thread  during linking   so i decided to use the latest build from download section in  readme md  of   after decrompression of jtr mingw   zip i tried to generate a hash file using following command     exe d    hdd saving   privat zip   d  zip hashes   but all i got is an error message box complaining about an execution error     here is the windows event log          event xmlns                                                        application      kischwa pc                   john exe                          libwinpthread   dll                                                      d  jtr mingw   run john exe      d  jtr mingw   run libwinpthread   dll                                        ,159422255,2648484842.0,IssuesEvent,2015-03-14 00:16:03,prikhi/pencil,https://api.github.com/repos/prikhi/pencil,closed,XML Parsing Error when exporting document,2โ€“5 stars bug imported Priority-Medium,"_From [paul.b.d...@gmail.com](https://code.google.com/u/105322434964372756384/) on February 23, 2010 12:46:32_595 596What steps will reproduce the problem? 1. Install standalone pencil5972. Install Document Export template for Simple HTML5983. Start new document5994. Select Document->Export Document6005. Select ""Single web page""6016. Select ""All pages in the document""6027. Select ""Default HTML Template"" What is the expected output? What do you see instead? Expect a html file somewhere yet I get the following error:603 604XML Parsing Error: undefined entity605Location: chrome://mozapps/content/downloads/unknownContentType.xul606Line Number 30, Column 18:    \<description>&intro.label;</description>607-----------------^ What version of the product are you using? On what operating system? Version 1.1 build 1608On Windows XP SP2 Please provide any additional information below.609 610_Original issue: http://code.google.com/p/evoluspencil/issues/detail?id=149_",1.0,"XML Parsing Error when exporting document - _From [paul.b.d...@gmail.com](https://code.google.com/u/105322434964372756384/) on February 23, 2010 12:46:32_611 612What steps will reproduce the problem? 1. Install standalone pencil6132. Install Document Export template for Simple HTML6143. Start new document6154. Select Document->Export Document6165. Select ""Single web page""6176. Select ""All pages in the document""6187. Select ""Default HTML Template"" What is the expected output? What do you see instead? Expect a html file somewhere yet I get the following error:619 620XML Parsing Error: undefined entity621Location: chrome://mozapps/content/downloads/unknownContentType.xul622Line Number 30, Column 18:    \<description>&intro.label;</description>623-----------------^ What version of the product are you using? On what operating system? Version 1.1 build 1624On Windows XP SP2 Please provide any additional information below.625 626_Original issue: http://code.google.com/p/evoluspencil/issues/detail?id=149_",0,xml parsing error when exporting document    from     on february              what steps will reproduce the problem     install standalone pencil     install document export template for simple html     start new document     select document  export document     select  single web page      select  all pages in the document      select  default html template  what is the expected output  what do you see instead  expect a html file somewhere yet i get the following error     xml parsing error  undefined entity  location  chrome   mozapps content downloads unknowncontenttype xul  line number    column          intro label                       what version of the product are you using  on what operating system  version     build    on windows xp   please provide any additional information below    original issue   ,0627664,8759629429.0,IssuesEvent,2018-12-15 18:15:04,magnumripper/JohnTheRipper,https://api.github.com/repos/magnumripper/JohnTheRipper,closed,New warnings on bleeding-jumbo (ZTEX builds),portability,"This is **NOT** gcc 8 new rules.628 629```630device.c: In function 'device_init_fpgas':631device.c:157:32: warning: '%d' directive writing 1 byte into a region of size between 0 and 255 [-Wformat-overflow=]632    sprintf(conf_name_freq, ""%s_%d"", conf_name_board_freq, fpga_num);633                                ^~634device.c:157:28: note: directive argument in the range [0, 4]635    sprintf(conf_name_freq, ""%s_%d"", conf_name_board_freq, fpga_num);636                            ^~~~~~~637In file included from /usr/include/stdio.h:862,638                 from device.c:12:639/usr/include/x86_64-linux-gnu/bits/stdio2.h:33:10: note: '__builtin___sprintf_chk' output between 3 and 258 bytes into a destination of size 256640   return __builtin___sprintf_chk (__s, __USE_FORTIFY_LEVEL - 1,641          ^~~~~~~~~~~~~~~~~~~~~~~~~~~~~~~~~~~~~~~~~~~~~~~~~~~~~~642       __bos (__s), __fmt, __va_arg_pack ());643       ~~~~~~~~~~~~~~~~~~~~~~~~~~~~~~~~~~~~~644device.c:207:34: warning: '%d' directive writing 1 byte into a region of size between 0 and 255 [-Wformat-overflow=]645   sprintf(conf_name_config1, ""%s_%d"", conf_name_board_config1,646                                  ^~647device.c:207:30: note: directive argument in the range [0, 4]648   sprintf(conf_name_config1, ""%s_%d"", conf_name_board_config1,649                              ^~~~~~~650In file included from /usr/include/stdio.h:862,651                 from device.c:12:652/usr/include/x86_64-linux-gnu/bits/stdio2.h:33:10: note: '__builtin___sprintf_chk' output between 3 and 258 bytes into a destination of size 256653   return __builtin___sprintf_chk (__s, __USE_FORTIFY_LEVEL - 1,654          ^~~~~~~~~~~~~~~~~~~~~~~~~~~~~~~~~~~~~~~~~~~~~~~~~~~~~~655       __bos (__s), __fmt, __va_arg_pack ());656       ~~~~~~~~~~~~~~~~~~~~~~~~~~~~~~~~~~~~~657```",True,"New warnings on bleeding-jumbo (ZTEX builds) - This is **NOT** gcc 8 new rules.658 659```660device.c: In function 'device_init_fpgas':661device.c:157:32: warning: '%d' directive writing 1 byte into a region of size between 0 and 255 [-Wformat-overflow=]662    sprintf(conf_name_freq, ""%s_%d"", conf_name_board_freq, fpga_num);663                                ^~664device.c:157:28: note: directive argument in the range [0, 4]665    sprintf(conf_name_freq, ""%s_%d"", conf_name_board_freq, fpga_num);666                            ^~~~~~~667In file included from /usr/include/stdio.h:862,668                 from device.c:12:669/usr/include/x86_64-linux-gnu/bits/stdio2.h:33:10: note: '__builtin___sprintf_chk' output between 3 and 258 bytes into a destination of size 256670   return __builtin___sprintf_chk (__s, __USE_FORTIFY_LEVEL - 1,671          ^~~~~~~~~~~~~~~~~~~~~~~~~~~~~~~~~~~~~~~~~~~~~~~~~~~~~~672       __bos (__s), __fmt, __va_arg_pack ());673       ~~~~~~~~~~~~~~~~~~~~~~~~~~~~~~~~~~~~~674device.c:207:34: warning: '%d' directive writing 1 byte into a region of size between 0 and 255 [-Wformat-overflow=]675   sprintf(conf_name_config1, ""%s_%d"", conf_name_board_config1,676                                  ^~677device.c:207:30: note: directive argument in the range [0, 4]678   sprintf(conf_name_config1, ""%s_%d"", conf_name_board_config1,679                              ^~~~~~~680In file included from /usr/include/stdio.h:862,681                 from device.c:12:682/usr/include/x86_64-linux-gnu/bits/stdio2.h:33:10: note: '__builtin___sprintf_chk' output between 3 and 258 bytes into a destination of size 256683   return __builtin___sprintf_chk (__s, __USE_FORTIFY_LEVEL - 1,684          ^~~~~~~~~~~~~~~~~~~~~~~~~~~~~~~~~~~~~~~~~~~~~~~~~~~~~~685       __bos (__s), __fmt, __va_arg_pack ());686       ~~~~~~~~~~~~~~~~~~~~~~~~~~~~~~~~~~~~~687```",1,new warnings on bleeding jumbo  ztex builds    this is   not   gcc   new rules          device c  in function  device init fpgas    device c      warning    d  directive writing   byte into a region of size between   and          sprintf conf name freq    s  d   conf name board freq  fpga num                                        device c      note  directive argument in the range        sprintf conf name freq    s  d   conf name board freq  fpga num                                         in file included from  usr include stdio h                      from device c      usr include     linux gnu bits   h      note     builtin   sprintf chk  output between   and   bytes into a destination of size       return   builtin   sprintf chk    s    use fortify level                                                                                  bos    s     fmt    va arg pack                                                     device c      warning    d  directive writing   byte into a region of size between   and         sprintf conf name      s  d   conf name board                                           device c      note  directive argument in the range       sprintf conf name      s  d   conf name board                                            in file included from  usr include stdio h                      from device c      usr include     linux gnu bits   h      note     builtin   sprintf chk  output between   and   bytes into a destination of size       return   builtin   sprintf chk    s    use fortify level                                                                                  bos    s     fmt    va arg pack                                                        ,1688670,8880155230.0,IssuesEvent,2019-01-14 03:56:41,magnumripper/JohnTheRipper,https://api.github.com/repos/magnumripper/JohnTheRipper,opened,Test our python scripts with Python 3.x,portability,It would be great to test our Python scripts with Python 3.x.,True,Test our python scripts with Python 3.x - It would be great to test our Python scripts with Python 3.x.,1,test our python scripts with python   x   it would be great to test our python scripts with python   x ,1689842,10855363392.0,IssuesEvent,2019-11-13 18:13:57,magnumripper/JohnTheRipper,https://api.github.com/repos/magnumripper/JohnTheRipper,closed,bitcoin2john.py Python 3 compatibility,Maintenance/cleanup portability,"A revision of `bitcoin2john.py` (per #4142) when run on an altcoin wallet with Python 2 produces a ""hash"", whereas when run with Python 3 says ""this wallet is not encrypted!"" (missing a linefeed after that message - something we should fix as well).690 691This could indicate a Python 3 compatibility issue in the script itself, or it might be a side-effect of differences in Berkeley DB versions in use by these two Python builds on this system (although I'd have expected the `db.open` call to fail, like it sometimes does, if the DB type is unsupported). To get the script to work with Python 3 on this throw-away Fedora VM, I had to explicitly install Berkeley DB support for it:692 693```694dnf install libdb-devel python3-devel695pip3 install bsddb3696```697 698I hope this is right. For Python 2, the system had working Berkeley DB support out of the box.699 700Also, the uses of `print` in `if __name__ == '__main__':` are Python 2 specific.701 702Related: #3591, #4085.",True,"bitcoin2john.py Python 3 compatibility - A revision of `bitcoin2john.py` (per #4142) when run on an altcoin wallet with Python 2 produces a ""hash"", whereas when run with Python 3 says ""this wallet is not encrypted!"" (missing a linefeed after that message - something we should fix as well).703 704This could indicate a Python 3 compatibility issue in the script itself, or it might be a side-effect of differences in Berkeley DB versions in use by these two Python builds on this system (although I'd have expected the `db.open` call to fail, like it sometimes does, if the DB type is unsupported). To get the script to work with Python 3 on this throw-away Fedora VM, I had to explicitly install Berkeley DB support for it:705 706```707dnf install libdb-devel python3-devel708pip3 install bsddb3709```710 711I hope this is right. For Python 2, the system had working Berkeley DB support out of the box.712 713Also, the uses of `print` in `if __name__ == '__main__':` are Python 2 specific.714 715Related: #3591, #4085.",1,  py python   compatibility   a revision of    py   per     when run on an altcoin wallet with python   produces a  hash   whereas when run with python   says  this wallet is not encrypted    missing a linefeed after that message   something we should fix as well      this could indicate a python   compatibility issue in the script itself  or it might be a side effect of differences in berkeley db versions in use by these two python builds on this system  although i d have expected the  db open  call to fail  like it sometimes does  if the db type is unsupported   to get the script to work with python   on this throw away fedora vm  i had to explicitly install berkeley db support for it          dnf install libdb devel   devel    install           i hope this is right  for python    the system had working berkeley db support out of the box     also  the uses of  print  in  if   name         main      are python   specific     related         ,1716137,3491497054.0,IssuesEvent,2016-01-04 15:57:47,magnumripper/JohnTheRipper,https://api.github.com/repos/magnumripper/JohnTheRipper,closed,Some failing opencl format tests with beignet on haswell GPU,notes/external issues portability,"During my experiments to get the Haswell GPU working, I probably found some beignet / libdrm / i915 driver issues and may be some bleeding-jumbo issues.717 718On my 64bit Fedora 22 with Haswell CPU Intel(R) Core(TM) i5-4570 CPU @ 3.20GHz, after installing beignet (I tried both the fedora package and the latest http://anongit.freedesktop.org/git/beignet.git commit):719 720Here, I am not sure whether the `multiple unsequenced modifications to 'p'` warning indicates a real problem:721```722$ OCL_IGNORE_SELF_TEST=1 ./john --test=0 --format=oldoffice-opencl723Failed to release test userptr object! (9) i915 kernel driver may not be sane!724Failed to release test userptr object! (9) i915 kernel driver may not be sane!725drm_intel_gem_bo_context_exec() failed: Invalid argument726Failed to release test userptr object! (9) i915 kernel driver may not be sane!727Beignet: self-test failed: (3, 7, 5) + (5, 7, 3) returned (3, 7, 5)728See README.md or http://www.freedesktop.org/wiki/Software/Beignet/729Beignet: warning - disable atomic in L3 feature.730Beignet: Warning - overriding self-test failure731Failed to release test userptr object! (9) i915 kernel driver may not be sane!732Beignet: Warning - overriding self-test failure733Failed to release test userptr object! (9) i915 kernel driver may not be sane!734Device 0: Intel(R) HD Graphics Haswell GT2 Desktop735Testing: oldoffice-opencl, MS Office <= 2003 [MD5/SHA1 RC4 OpenCL]... Build log: /tmp/fxgfQc.cl:224:24: warning: multiple unsequenced modifications to 'p'736/tmp/fxgfQc.cl:441:15: warning: multiple unsequenced modifications to 'p'737 738FAILED (cmp_all(1))739 740Failed to release test userptr object! (9) i915 kernel driver may not be sane!741```742 743The only statements that may trigger that `multiple unsequenced modifications to 'p'` warning IMHO are744```745oldoffice_kernel.cl:194:                        W[i >> 1] = (uint)*p++ | (*p++ << 16U);746oldoffice_kernel.cl:197:                        W[i >> 1] = (uint)*p++ | (*p++ << 16U);747oldoffice_kernel.cl:210:                        W[i >> 1] = (uint)*p++ | (*p++ << 16U);748oldoffice_kernel.cl:224:                        W[i >> 1] = (uint)*p++ | (*p++ << 16U);749oldoffice_kernel.cl:408:                        uint u = *p++ | (*p++ << 16U);750oldoffice_kernel.cl:413:                        uint u = *p++ | (*p++ << 16U);751oldoffice_kernel.cl:426:                        uint u = *p++ | (*p++ << 16U);752oldoffice_kernel.cl:441:                        uint u = *p++ | (*p++ << 16U);753```754Can any of the above be a problem?755 756 757 758I hope that these warnings759```760Failed to release test userptr object! (9) i915 kernel driver may not be sane!761Failed to release test userptr object! (9) i915 kernel driver may not be sane!762```763will disappear after a future libdrm or linux kernel upgrade and that the764```765drm_intel_gem_bo_context_exec() failed: Invalid argument766```767problem will be fixed in future beignet versions.768 769May be when I get rid of the `disable atomic in L3 feature` due to the failed self test and when I disable the debug CFLAGS from my beignet build, the performance will improve...770 771For now, I just use OCL_IGNORE_SELF_TEST=1, otherwise the Haswell GPU will be skipped:772```773$ ./john --list=opencl-devices 774Failed to release test userptr object! (9) i915 kernel driver may not be sane!775Failed to release test userptr object! (9) i915 kernel driver may not be sane!776drm_intel_gem_bo_context_exec() failed: Invalid argument777Failed to release test userptr object! (9) i915 kernel driver may not be sane!778Beignet: self-test failed: (3, 7, 5) + (5, 7, 3) returned (3, 7, 5)779See README.md or http://www.freedesktop.org/wiki/Software/Beignet/780Beignet: warning - disable atomic in L3 feature.781Beignet: disabling non-working device782OpenCL error (CL_DEVICE_NOT_FOUND) in file (common-opencl.c) at line (385) - (No OpenCL device of that type exist)783```784 785```786$ OCL_IGNORE_SELF_TEST=1 ./john --list=opencl-devices             787Failed to release test userptr object! (9) i915 kernel driver may not be sane!788Failed to release test userptr object! (9) i915 kernel driver may not be sane!789drm_intel_gem_bo_context_exec() failed: Invalid argument790Failed to release test userptr object! (9) i915 kernel driver may not be sane!791Beignet: self-test failed: (3, 7, 5) + (5, 7, 3) returned (3, 7, 5)792See README.md or http://www.freedesktop.org/wiki/Software/Beignet/793Beignet: warning - disable atomic in L3 feature.794Beignet: Warning - overriding self-test failure795Failed to release test userptr object! (9) i915 kernel driver may not be sane!796Beignet: Warning - overriding self-test failure797Failed to release test userptr object! (9) i915 kernel driver may not be sane!798Platform #0 name: Intel Gen OCL Driver799Platform version: OpenCL 1.2 beignet 1.1 (git-834d0ae)800	Device #0 (0) name:	Intel(R) HD Graphics Haswell GT2 Desktop801Failed to release test userptr object! (9) i915 kernel driver may not be sane!802	Device vendor:		Intel803	Device type:		GPU (LE)804	Device version:		OpenCL 1.2 beignet 1.1 (git-834d0ae)805	Driver version:		1.1806	Native vector widths:	char 8, short 8, int 4, long 2807	Preferred vector width:	char 16, short 8, int 4, long 2808	Global Memory:		2.0 GB809	Global Memory Cache:	8.0 KB810	Local Memory:		64.0 KB (Global)811	Max memory alloc. size:	1024.0 MB812	Max clock (MHz):	1000813	Profiling timer res.:	80 ns814	Max Work Group Size:	512815	Parallel compute cores:	20816 817```818 819```820$ OCL_IGNORE_SELF_TEST=1 ./john --list=opencl-devices --verbosity=5821Failed to release test userptr object! (9) i915 kernel driver may not be sane!822Failed to release test userptr object! (9) i915 kernel driver may not be sane!823drm_intel_gem_bo_context_exec() failed: Invalid argument824Failed to release test userptr object! (9) i915 kernel driver may not be sane!825Beignet: self-test failed: (3, 7, 5) + (5, 7, 3) returned (3, 7, 5)826See README.md or http://www.freedesktop.org/wiki/Software/Beignet/827Beignet: warning - disable atomic in L3 feature.828Beignet: Warning - overriding self-test failure829Failed to release test userptr object! (9) i915 kernel driver may not be sane!830Beignet: Warning - overriding self-test failure831Failed to release test userptr object! (9) i915 kernel driver may not be sane!832Platform #0 name: Intel Gen OCL Driver833Platform version: OpenCL 1.2 beignet 1.1 (git-834d0ae)834	Platform extensions:	cl_khr_global_int32_base_atomics cl_khr_global_int32_extended_atomics cl_khr_local_int32_base_atomics cl_khr_local_int32_extended_atomics cl_khr_byte_addressable_store cl_khr_spir cl_khr_icd835	Device #0 (0) name:	Intel(R) HD Graphics Haswell GT2 Desktop836Failed to release test userptr object! (9) i915 kernel driver may not be sane!837	Device vendor:		Intel838	Device type:		GPU (LE)839	Device version:		OpenCL 1.2 beignet 1.1 (git-834d0ae)840	Driver version:		1.1841	Native vector widths:	char 8, short 8, int 4, long 2842	Preferred vector width:	char 16, short 8, int 4, long 2843	Global Memory:		2.0 GB844	Device extensions:	cl_khr_global_int32_base_atomics cl_khr_global_int32_extended_atomics cl_khr_local_int32_base_atomics cl_khr_local_int32_extended_atomics cl_khr_byte_addressable_store cl_khr_spir cl_khr_icd845	Global Memory Cache:	8.0 KB846	Local Memory:		64.0 KB (Global)847	Max memory alloc. size:	1024.0 MB848	Max clock (MHz):	1000849	Profiling timer res.:	80 ns850	Max Work Group Size:	512851	Parallel compute cores:	20852```853 854Most opencl formats pass self test, with c/s rate between 10% and 90% of the CPU (4*OMP).855For rar, opencl gets closest:856```857$ ./john --test --format=rar858Will run 4 OpenMP threads859Benchmarking: rar, RAR3 (4 characters) [SHA1 AES 32/64]... (4xOMP) DONE860Raw:	403 c/s real, 100 c/s virtual861 862$ OCL_IGNORE_SELF_TEST=1 ./john --test --format=rar-opencl --verbosity=5863initUnicode(UNICODE, ASCII/ASCII)864ASCII -> ASCII -> ASCII865Will run 4 OpenMP threads866Failed to release test userptr object! (9) i915 kernel driver may not be sane!867Failed to release test userptr object! (9) i915 kernel driver may not be sane!868drm_intel_gem_bo_context_exec() failed: Invalid argument869Failed to release test userptr object! (9) i915 kernel driver may not be sane!870Beignet: self-test failed: (3, 7, 5) + (5, 7, 3) returned (3, 7, 5)871See README.md or http://www.freedesktop.org/wiki/Software/Beignet/872Beignet: warning - disable atomic in L3 feature.873Beignet: Warning - overriding self-test failure874Failed to release test userptr object! (9) i915 kernel driver may not be sane!875Beignet: Warning - overriding self-test failure876Failed to release test userptr object! (9) i915 kernel driver may not be sane!877Device 0: Intel(R) HD Graphics Haswell GT2 Desktop878Benchmarking: rar-opencl, RAR3 (length 5) [SHA1 OpenCL AES]... (4xOMP) Options used: -I ./kernels -cl-mad-enable -D__GPU__ -DDEVICE_INFO=34 -DDEV_VER_MAJOR=1 -DDEV_VER_MINOR=1 -D_OPENCL_COMPILER -DPLAINTEXT_LENGTH=22879Calculating best global worksize (GWS); max. 10s total for crypt_all()880Raw speed figures including buffer transfers:881key xfer: 115.517ms*, len xfer: 115.533ms*, init: 2.800us, loop: 16x52.082ms, final: 19.920us, key xfer: 101.292ms*, iv xfer: 107.760us*882gws:       256	       219 c/s    57409536 rounds/s    1.165s per crypt_all()!883key xfer: 199.327ms*, len xfer: 199.329ms*, init: 1.680us, loop: 16x99.704ms, final: 19.520us, key xfer: 199.272ms*, iv xfer: 88.480us*884gws:       512	       233 c/s    61079552 rounds/s    2.193s per crypt_all()+885key xfer: 364.582ms*, len xfer: 364.586ms*, init: 2.320us, loop: 16x182.919ms, final: 35.040us, key xfer: 364.498ms*, iv xfer: 73.920us*886gws:      1024	       254 c/s    66584576 rounds/s    4.020s per crypt_all()+887key xfer: 1.440us, len xfer: 1.280us, init: 2.800us, loop: 16x349.420ms, final: 36us, key xfer: 1.280us, iv xfer: 1.200us888gws:      2048	       366 c/s    95944704 rounds/s    5.590s per crypt_all()+889key xfer: 1.440us, len xfer: 1.120us, init: 5.760us, loop: 16x687.015ms, final: 65.600us, key xfer: 1.120us, iv xfer: 10.575ms*890gws:      4096	       372 c/s    97517568 rounds/s   11.002s per crypt_all() - too slow891Local worksize (LWS) 64, global worksize (GWS) 2048892DONE893Raw:	364 c/s real, 102400 c/s virtual894 895```896 897BTW: why is the CPU format using length 4, but the GPU length 5?898 899And these are all the failing self tests:900```901initUnicode(UNICODE, ASCII/ASCII)902ASCII -> ASCII -> ASCII903Device 0: Intel(R) HD Graphics Haswell GT2 Desktop904Benchmarking: oldoffice-opencl, MS Office <= 2003 [MD5/SHA1 RC4 OpenCL]... Options used: -I ./kernels -cl-mad-enable -D__GPU__ -DDEVICE_INFO=34 -DDEV_VER_MAJOR=1 -DDEV_VER_MINOR=1 -D_OPENCL_COMPILER -DASCII -DPLAINTEXT_LENGTH=19905Build log: /tmp/DAFnPU.cl:224:24: warning: multiple unsequenced modifications to 'p'906/tmp/DAFnPU.cl:441:15: warning: multiple unsequenced modifications to 'p'907 908Calculating best global worksize (GWS); max. 1s total for crypt_all()909Raw speed figures including buffer transfers:910xP: 1.746ms*, xI: 1.747ms*, enc: 53.760us, md5+rc4: 1.466ms, xR: 1.543ms*911gws:      1024	    156160 c/s      156160 rounds/s   6.557ms per crypt_all()!912xP: 3.068ms*, xI: 3.072ms*, enc: 39.360us, md5+rc4: 2.868ms, xR: 3.004ms*913gws:      2048	    169902 c/s      169902 rounds/s  12.054ms per crypt_all()+914xP: 5.818ms*, xI: 5.805ms*, enc: 75.280us, md5+rc4: 5.614ms, xR: 5.729ms*915gws:      4096	    177750 c/s      177750 rounds/s  23.043ms per crypt_all()+916xP: 10.606ms*, xI: 10.581ms*, enc: 146.080us, md5+rc4: 10.284ms, xR: 10.468ms*917gws:      8192	    194643 c/s      194643 rounds/s  42.087ms per crypt_all()+918xP: 20.173ms*, xI: 20.117ms*, enc: 285.600us, md5+rc4: 19.524ms, xR: 19.923ms*919gws:     16384	    204735 c/s      204735 rounds/s  80.025ms per crypt_all()+920xP: 38.848ms*, xI: 38.835ms*, enc: 595.600us, md5+rc4: 37.806ms, xR: 38.401ms*921gws:     32768	    212107 c/s      212107 rounds/s 154.487ms per crypt_all()+922xP: 75.759ms*, xI: 75.554ms*, enc: 1.200ms, md5+rc4: 73.755ms, xR: 75.026ms*923gws:     65536	    217513 c/s      217513 rounds/s 301.295ms per crypt_all()+924xP: 149.298ms*, xI: 148.891ms*, enc: 2.294ms, md5+rc4: 145.494ms, xR: 147.853ms*925gws:    131072	    220722 c/s      220722 rounds/s 593.831ms per crypt_all()+926xP: 1.440us, xI: 298.903ms*, enc: 4.523ms, md5+rc4: 291.022ms, xR: 295.578ms*927gws:    262144	    294534 c/s      294534 rounds/s 890.028ms per crypt_all()+928xP: 1.920us, xI: 1.520us, enc: 9.227ms, md5+rc4: 576.541ms, xR: 1.360us929gws:    524288	    895035 c/s      895035 rounds/s 585.773ms per crypt_all()!930xP: 2.240us, xI: 1.280us, enc: 18.194ms, md5+rc4: 1.155s, xR: 1.440us931gws:   1048576	    893037 c/s      893037 rounds/s    1.174s per crypt_all() - too slow932Local worksize (LWS) 64, global worksize (GWS) 524288933FAILED (cmp_all(1))934 935initUnicode(UNICODE, ASCII/ASCII)936ASCII -> ASCII -> ASCII937Device 0: Intel(R) HD Graphics Haswell GT2 Desktop938Benchmarking: lotus5-opencl, Lotus Notes/Domino 5 [OpenCL]... Options used: -I ./kernels -cl-mad-enable -D__GPU__ -DDEVICE_INFO=34 -DDEV_VER_MAJOR=1 -DDEV_VER_MINOR=1 -D_OPENCL_COMPILER 939Calculating best global worksize (GWS); max. 1s single kernel invocation.940Raw speed figures including buffer transfers:941xfer: 833.920us*, crypt: 487.520us, xfer: 550.880us*942gws:       256	    136728 c/s      136728 rounds/s   1.872ms per crypt_all()!943xfer: 886.800us*, crypt: 752.320us, xfer: 861.200us*944gws:       512	    204773 c/s      204773 rounds/s   2.500ms per crypt_all()+945xfer: 1.773ms*, crypt: 1.641ms, xfer: 1.738ms*946gws:      1024	    198683 c/s      198683 rounds/s   5.153ms per crypt_all()947xfer: 3.115ms*, crypt: 2.980ms, xfer: 3.087ms*948gws:      2048	    223010 c/s      223010 rounds/s   9.183ms per crypt_all()+949xfer: 6.011ms*, crypt: 5.858ms, xfer: 5.957ms*950gws:      4096	    229759 c/s      229759 rounds/s  17.827ms per crypt_all()+951xfer: 11.924ms*, crypt: 11.736ms, xfer: 11.839ms*952gws:      8192	    230756 c/s      230756 rounds/s  35.500ms per crypt_all()953xfer: 23.686ms*, crypt: 23.426ms, xfer: 23.538ms*954gws:     16384	    231898 c/s      231898 rounds/s  70.651ms per crypt_all()955xfer: 46.946ms*, crypt: 46.512ms, xfer: 46.656ms*956gws:     32768	    233863 c/s      233863 rounds/s 140.115ms per crypt_all()+957xfer: 1.040us, crypt: 92.609ms, xfer: 92.877ms*958gws:     65536	    353316 c/s      353316 rounds/s 185.487ms per crypt_all()+959xfer: 1.360us, crypt: 185.871ms, xfer: 186.244ms*960gws:    131072	    352232 c/s      352232 rounds/s 372.117ms per crypt_all()961xfer: 1.360us, crypt: 370.840ms, xfer: 371.800ms*962gws:    262144	    352988 c/s      352988 rounds/s 742.642ms per crypt_all()963xfer: 1.040us, crypt: 743.818ms, xfer: 745.505ms*964gws:    524288	    352030 c/s      352030 rounds/s    1.489s per crypt_all()965xfer: 2.400us, crypt: 1.484s (exceeds 1s)966Local worksize (LWS) 64, global worksize (GWS) 65536967FAILED (cmp_all(1))968 969initUnicode(UNICODE, ASCII/ASCII)970ASCII -> ASCII -> ASCII971Device 0: Intel(R) HD Graphics Haswell GT2 Desktop972Options used: -I ./kernels -cl-mad-enable -D__GPU__ -DDEVICE_INFO=34 -DDEV_VER_MAJOR=1 -DDEV_VER_MINOR=1 -D_OPENCL_COMPILER -DWORK_GROUP_SIZE=8973Local worksize (LWS) 8, Global worksize (GWS) 1024974Benchmarking: bcrypt-opencl (""$2a$05"", 32 iterations) [Blowfish OpenCL]... FAILED (cmp_all(1))975 976initUnicode(UNICODE, ASCII/ASCII)977ASCII -> ASCII -> ASCII978Device 0: Intel(R) HD Graphics Haswell GT2 Desktop979Options used: -I ./kernels -cl-mad-enable -D__GPU__ -DDEVICE_INFO=34 -DDEV_VER_MAJOR=1 -DDEV_VER_MINOR=1 -D_OPENCL_COMPILER 980ASSERTION FAILED: 0981  at file /home/fd/git/beignet/backend/src/backend/gen_context.cpp, function virtual void gbe::GenContext::emitUnaryWithTempInstruction(const gbe::SelectionInstruction&), line 438982initUnicode(UNICODE, ASCII/ASCII)983ASCII -> ASCII -> ASCII984Device 0: Intel(R) HD Graphics Haswell GT2 Desktop985Options used: -I ./kernels -cl-mad-enable -D__GPU__ -DDEVICE_INFO=34 -DDEV_VER_MAJOR=1 -DDEV_VER_MINOR=1 -D_OPENCL_COMPILER 986Options used: -I ./kernels -cl-mad-enable -D__GPU__ -DDEVICE_INFO=34 -DDEV_VER_MAJOR=1 -DDEV_VER_MINOR=1 -D_OPENCL_COMPILER 987Local worksize (LWS) 64, Global worksize (GWS) 8192988Benchmarking: descrypt-opencl, traditional crypt(3) [DES OpenCL]... FAILED (cmp_one(0))989 990initUnicode(UNICODE, ASCII/ASCII)991ASCII -> ASCII -> ASCII992Device 0: Intel(R) HD Graphics Haswell GT2 Desktop993Benchmarking: krb5pa-md5-opencl, Kerberos 5 AS-REQ Pre-Auth etype 23 [MD4 HMAC-MD5 RC4 OpenCL]... Options used: -I ./kernels -cl-mad-enable -D__GPU__ -DDEVICE_INFO=34 -DDEV_VER_MAJOR=1 -DDEV_VER_MINOR=1 -D_OPENCL_COMPILER -DASCII -DPLAINTEXT_LENGTH=27994Calculating best global worksize (GWS); max. 200ms single kernel invocation.995Raw speed figures including buffer transfers:996xfer: 599.920us*, init: 35.280us, crypt: 187.360us, xfer: 251.280us*997gws:       256	    238396 c/s      238396 rounds/s   1.073ms per crypt_all()!998xfer: 315.920us*, init: 21.360us, crypt: 217.360us, xfer: 285.120us*999gws:       512	    609698 c/s      609698 rounds/s 839.760us per crypt_all()!1000xfer: 517.840us*, init: 38.720us, crypt: 420.240us, xfer: 487.600us*1001gws:      1024	    699262 c/s      699262 rounds/s   1.464ms per crypt_all()+1002xfer: 1.057ms*, init: 76us, crypt: 852.880us, xfer: 1.022ms*1003gws:      2048	    680651 c/s      680651 rounds/s   3.008ms per crypt_all()1004xfer: 1.868ms*, init: 152.800us, crypt: 1.574ms, xfer: 1.805ms*1005gws:      4096	    758282 c/s      758282 rounds/s   5.401ms per crypt_all()+1006xfer: 3.460ms*, init: 257.680us, crypt: 3.044ms, xfer: 3.368ms*1007gws:      8192	    808616 c/s      808616 rounds/s  10.130ms per crypt_all()+1008xfer: 6.591ms*, init: 538.880us, crypt: 5.843ms, xfer: 6.458ms*1009gws:     16384	    843086 c/s      843086 rounds/s  19.433ms per crypt_all()+1010xfer: 12.555ms*, init: 1.016ms, crypt: 11.198ms, xfer: 12.309ms*1011gws:     32768	    883728 c/s      883728 rounds/s  37.079ms per crypt_all()+1012xfer: 24.328ms*, init: 2.031ms, crypt: 21.744ms, xfer: 23.894ms*1013gws:     65536	    910238 c/s      910238 rounds/s  71.998ms per crypt_all()+1014xfer: 1.200us, init: 4.020ms, crypt: 42.825ms, xfer: 47.095ms*1015gws:    131072	   1395235 c/s     1395235 rounds/s  93.942ms per crypt_all()+1016xfer: 1.040us, init: 7.988ms, crypt: 85.503ms, xfer: 93.441ms*1017gws:    262144	   1402330 c/s     1402330 rounds/s 186.934ms per crypt_all()1018xfer: 2.480us, init: 15.840ms, crypt: 168.811ms, xfer: 1.360us1019gws:    524288	   2839267 c/s     2839267 rounds/s 184.656ms per crypt_all()!1020xfer: 1.760us, init: 32.312ms, crypt: 336.594ms (exceeds 200ms)1021Local worksize (LWS) 64, global worksize (GWS) 5242881022FAILED (cmp_all(1))1023 1024initUnicode(UNICODE, ASCII/ASCII)1025ASCII -> ASCII -> ASCII1026Device 0: Intel(R) HD Graphics Haswell GT2 Desktop1027Benchmarking: nt-opencl, NT [MD4 OpenCL]... Options used: -I ./kernels -cl-mad-enable -D__GPU__ -DDEVICE_INFO=34 -DDEV_VER_MAJOR=1 -DDEV_VER_MINOR=1 -D_OPENCL_COMPILER -D OFFSET_TABLE_SIZE=32 -D HASH_TABLE_SIZE=43 -D SHIFT64_OT_SZ=0 -D SHIFT64_HT_SZ=41 -D NUM_LOADED_HASHES=41 -D NUM_INT_KEYS=1 -D SELECT_CMP_STEPS=4 -D BITMAP_SIZE_BITS_LESS_ONE=32767 -D USE_LOCAL_BITMAPS=1 -D IS_STATIC_GPU_MASK=0 -D CONST_CACHE_SIZE=134217728 -D LOC_0=-1 -D LOC_1=-1 -D LOC_2=-1 -D LOC_3=-11028Self test GWS: 2097152, LWS: 2561029FAILED (cmp_all(0))1030 1031initUnicode(UNICODE, ASCII/ASCII)1032ASCII -> ASCII -> ASCII1033Will run 4 OpenMP threads1034Device 0: Intel(R) HD Graphics Haswell GT2 Desktop1035Benchmarking: office2013-opencl, MS Office 2013 (100,000 iterations) [SHA512 OpenCL 2x AES]... (4xOMP) Options used: -I ./kernels -cl-mad-enable -D__GPU__ -DDEVICE_INFO=34 -DDEV_VER_MAJOR=1 -DDEV_VER_MINOR=1 -D_OPENCL_COMPILER -DHASH_LOOPS=100 -DUNICODE_LENGTH=96 -DV_WIDTH=21036ASSERTION FAILED: 01037  at file /home/fd/git/beignet/backend/src/backend/gen_context.cpp, function virtual void gbe::GenContext::emitUnaryWithTempInstruction(const gbe::SelectionInstruction&), line 4381038initUnicode(UNICODE, ASCII/ASCII)1039ASCII -> ASCII -> ASCII1040Device 0: Intel(R) HD Graphics Haswell GT2 Desktop1041Benchmarking: PBKDF2-HMAC-SHA512-opencl, GRUB2 / OS X 10.8+, rounds=10000 [PBKDF2-SHA512 OpenCL]... Options used: -I ./kernels -cl-mad-enable -D__GPU__ -DDEVICE_INFO=34 -DDEV_VER_MAJOR=1 -DDEV_VER_MINOR=1 -D_OPENCL_COMPILER -DHASH_LOOPS=250 -DPLAINTEXT_LENGTH=110 -DMAX_SALT_SIZE=1071042ASSERTION FAILED: 01043  at file /home/fd/git/beignet/backend/src/backend/gen_context.cpp, function virtual void gbe::GenContext::emitUnaryWithTempInstruction(const gbe::SelectionInstruction&), line 4381044initUnicode(UNICODE, ASCII/ASCII)1045ASCII -> ASCII -> ASCII1046Device 0: Intel(R) HD Graphics Haswell GT2 Desktop1047Benchmarking: Raw-MD4-opencl [MD4 OpenCL]... Options used: -I ./kernels -cl-mad-enable -D__GPU__ -DDEVICE_INFO=34 -DDEV_VER_MAJOR=1 -DDEV_VER_MINOR=1 -D_OPENCL_COMPILER -D OFFSET_TABLE_SIZE=13 -D HASH_TABLE_SIZE=15 -D SHIFT64_OT_SZ=3 -D SHIFT64_HT_SZ=1 -D NUM_LOADED_HASHES=14 -D NUM_INT_KEYS=1 -D SELECT_CMP_STEPS=4 -D BITMAP_SIZE_BITS_LESS_ONE=32767 -D USE_LOCAL_BITMAPS=1 -D IS_STATIC_GPU_MASK=0 -D CONST_CACHE_SIZE=134217728 -D LOC_0=-1 -D LOC_1=-1 -D LOC_2=-1 -D LOC_3=-11048Self test GWS: 1048576, LWS: 2561049FAILED (cmp_all(0))1050 1051initUnicode(UNICODE, ASCII/ASCII)1052ASCII -> ASCII -> ASCII1053Device 0: Intel(R) HD Graphics Haswell GT2 Desktop1054Benchmarking: Raw-MD5-opencl [MD5 OpenCL]... Options used: -I ./kernels -cl-mad-enable -D__GPU__ -DDEVICE_INFO=34 -DDEV_VER_MAJOR=1 -DDEV_VER_MINOR=1 -D_OPENCL_COMPILER -D OFFSET_TABLE_SIZE=11 -D HASH_TABLE_SIZE=5 -D SHIFT64_OT_SZ=5 -D SHIFT64_HT_SZ=1 -D NUM_LOADED_HASHES=5 -D NUM_INT_KEYS=1 -D SELECT_CMP_STEPS=4 -D BITMAP_SIZE_BITS_LESS_ONE=32767 -D USE_LOCAL_BITMAPS=1 -D IS_STATIC_GPU_MASK=0 -D CONST_CACHE_SIZE=134217728 -D LOC_0=-1 -D LOC_1=-1 -D LOC_2=-1 -D LOC_3=-11055Self test GWS: 1048576, LWS: 2561056FAILED (cmp_all(0))1057 1058initUnicode(UNICODE, ASCII/ASCII)1059ASCII -> ASCII -> ASCII1060Device 0: Intel(R) HD Graphics Haswell GT2 Desktop1061Benchmarking: Raw-SHA1-opencl [SHA1 OpenCL]... Options used: -I ./kernels -cl-mad-enable -D__GPU__ -DDEVICE_INFO=34 -DDEV_VER_MAJOR=1 -DDEV_VER_MINOR=1 -D_OPENCL_COMPILER -D OFFSET_TABLE_SIZE=11 -D HASH_TABLE_SIZE=5 -D SHIFT64_OT_SZ=5 -D SHIFT64_HT_SZ=1 -D SHIFT128_OT_SZ=3 -D SHIFT128_HT_SZ=1 -D NUM_LOADED_HASHES=4 -D NUM_INT_KEYS=1 -D SELECT_CMP_STEPS=4 -D BITMAP_SIZE_BITS_LESS_ONE=32767 -D USE_LOCAL_BITMAPS=1 -D IS_STATIC_GPU_MASK=0 -D CONST_CACHE_SIZE=134217728 -D LOC_0=-1 -D LOC_1=-1 -D LOC_2=-1 -D LOC_3=-11062Self test GWS: 1048576, LWS: 2561063FAILED (cmp_all(0))1064 1065initUnicode(UNICODE, ASCII/ASCII)1066ASCII -> ASCII -> ASCII1067Device 0: Intel(R) HD Graphics Haswell GT2 Desktop1068Options used: -I ./kernels -cl-mad-enable -D__GPU__ -DDEVICE_INFO=34 -DDEV_VER_MAJOR=1 -DDEV_VER_MINOR=1 -D_OPENCL_COMPILER 1069Benchmarking: Raw-SHA256-opencl [SHA256 OpenCL]... Calculating best global worksize (GWS); max. 1s total for crypt_all()1070Raw speed figures including buffer transfers:1071pass xfer: 595.280us*, crypt: 404.160us, result xfer: 464.720us*, index xfer: 618.720us*1072gws:      1024	    491626 c/s      491626 rounds/s   2.082ms per crypt_all()!1073pass xfer: 827.120us*, crypt: 739.440us, result xfer: 785.360us*, index xfer: 829.840us*1074gws:      2048	    643668 c/s      643668 rounds/s   3.181ms per crypt_all()+1075pass xfer: 1.628ms*, crypt: 1.454ms, result xfer: 1.566ms*, index xfer: 1.614ms*1076gws:      4096	    653920 c/s      653920 rounds/s   6.263ms per crypt_all()+1077pass xfer: 3.012ms*, crypt: 2.780ms, result xfer: 2.892ms*, index xfer: 2.955ms*1078gws:      8192	    703731 c/s      703731 rounds/s  11.640ms per crypt_all()+1079pass xfer: 5.786ms*, crypt: 5.491ms, result xfer: 5.542ms*, index xfer: 5.627ms*1080gws:     16384	    729864 c/s      729864 rounds/s  22.448ms per crypt_all()+1081pass xfer: 11.123ms*, crypt: 10.653ms, result xfer: 10.753ms*, index xfer: 10.843ms*1082gws:     32768	    755478 c/s      755478 rounds/s  43.373ms per crypt_all()+1083pass xfer: 21.932ms*, crypt: 21.075ms, result xfer: 21.183ms*, index xfer: 21.338ms*1084gws:     65536	    766222 c/s      766222 rounds/s  85.531ms per crypt_all()+1085pass xfer: 42.630ms*, crypt: 42.106ms, result xfer: 42.217ms*, index xfer: 42.391ms*1086gws:    131072	    773992 c/s      773992 rounds/s 169.345ms per crypt_all()+1087pass xfer: 84.888ms*, crypt: 83.984ms, result xfer: 84.102ms*, index xfer: 84.428ms*1088gws:    262144	    776943 c/s      776943 rounds/s 337.404ms per crypt_all()1089pass xfer: 1.120us, crypt: 166.969ms, result xfer: 167.046ms*, index xfer: 167.826ms*1090gws:    524288	   1044726 c/s     1044726 rounds/s 501.842ms per crypt_all()+1091pass xfer: 338.504ms*, crypt: 335.524ms, result xfer: 335.601ms*, index xfer: 336.525ms*1092gws:   1048576	    778940 c/s      778940 rounds/s    1.346s per crypt_all() - too slow1093Max local worksize 512, Local worksize (LWS) 32, global worksize (GWS) 5242881094FAILED (cmp_all(0))1095 1096initUnicode(UNICODE, ASCII/ASCII)1097ASCII -> ASCII -> ASCII1098Device 0: Intel(R) HD Graphics Haswell GT2 Desktop1099Options used: -I ./kernels -cl-mad-enable -D__GPU__ -DDEVICE_INFO=34 -DDEV_VER_MAJOR=1 -DDEV_VER_MINOR=1 -D_OPENCL_COMPILER 1100ASSERTION FAILED: 01101  at file /home/fd/git/beignet/backend/src/backend/gen_context.cpp, function virtual void gbe::GenContext::emitUnaryWithTempInstruction(const gbe::SelectionInstruction&), line 4381102initUnicode(UNICODE, ASCII/ASCII)1103ASCII -> ASCII -> ASCII1104Device 0: Intel(R) HD Graphics Haswell GT2 Desktop1105Benchmarking: wpapsk-opencl, WPA/WPA2 PSK [PBKDF2-SHA1 OpenCL 4x]... Options used: -I ./kernels -cl-mad-enable -D__GPU__ -DDEVICE_INFO=34 -DDEV_VER_MAJOR=1 -DDEV_VER_MINOR=1 -D_OPENCL_COMPILER -DHASH_LOOPS=105 -DITERATIONS=4095 -DPLAINTEXT_LENGTH=63 -DV_WIDTH=41106ASSERTION FAILED: !(ctx->getErrCode() == OUT_OF_RANGE_IF_ENDIF && ctx->getIFENDIFFix())1107  at file /home/fd/git/beignet/backend/src/backend/gen_program.cpp, function virtual gbe::Kernel* gbe::GenProgram::compileKernel(const gbe::ir::Unit&, const string&, bool), line 1961108initUnicode(UNICODE, ASCII/ASCII)1109ASCII -> ASCII -> ASCII1110Device 0: Intel(R) HD Graphics Haswell GT2 Desktop1111Options used: -I ./kernels -cl-mad-enable -D__GPU__ -DDEVICE_INFO=34 -DDEV_VER_MAJOR=1 -DDEV_VER_MINOR=1 -D_OPENCL_COMPILER 1112ASSERTION FAILED: 01113  at file /home/fd/git/beignet/backend/src/backend/gen_context.cpp, function virtual void gbe::GenContext::emitUnaryWithTempInstruction(const gbe::SelectionInstruction&), line 4381114```1115 1116The common warnings1117```1118drm_intel_gem_bo_context_exec() failed: Invalid argument1119Failed to release test userptr object! (9) i915 kernel driver may not be sane!1120Beignet: self-test failed: (3, 7, 5) + (5, 7, 3) returned (3, 7, 5)1121See README.md or http://www.freedesktop.org/wiki/Software/Beignet/1122Beignet: warning - disable atomic in L3 feature.1123Beignet: Warning - overriding self-test failure1124```1125which appeared for every single test have been filtered using `grep -v`.1126 1127@magnum I wasn't sure whether I should create separate issues for every possible problem (failing format self tests etc.)1128 1129May be beignet, libdrm or the i915 driver are to blame for many of these.1130If you think I should have created multiple issues, I suggest that we keep this one for the `multiple unsequenced modifications to 'p'` warning in oldoffice-opencl (and may be the failing oldoffice-opencl self test), and I'll create new issues for the other failing self tests.",True,"Some failing opencl format tests with beignet on haswell GPU - During my experiments to get the Haswell GPU working, I probably found some beignet / libdrm / i915 driver issues and may be some bleeding-jumbo issues.1131 1132On my 64bit Fedora 22 with Haswell CPU Intel(R) Core(TM) i5-4570 CPU @ 3.20GHz, after installing beignet (I tried both the fedora package and the latest http://anongit.freedesktop.org/git/beignet.git commit):1133 1134Here, I am not sure whether the `multiple unsequenced modifications to 'p'` warning indicates a real problem:1135```1136$ OCL_IGNORE_SELF_TEST=1 ./john --test=0 --format=oldoffice-opencl1137Failed to release test userptr object! (9) i915 kernel driver may not be sane!1138Failed to release test userptr object! (9) i915 kernel driver may not be sane!1139drm_intel_gem_bo_context_exec() failed: Invalid argument1140Failed to release test userptr object! (9) i915 kernel driver may not be sane!1141Beignet: self-test failed: (3, 7, 5) + (5, 7, 3) returned (3, 7, 5)1142See README.md or http://www.freedesktop.org/wiki/Software/Beignet/1143Beignet: warning - disable atomic in L3 feature.1144Beignet: Warning - overriding self-test failure1145Failed to release test userptr object! (9) i915 kernel driver may not be sane!1146Beignet: Warning - overriding self-test failure1147Failed to release test userptr object! (9) i915 kernel driver may not be sane!1148Device 0: Intel(R) HD Graphics Haswell GT2 Desktop1149Testing: oldoffice-opencl, MS Office <= 2003 [MD5/SHA1 RC4 OpenCL]... Build log: /tmp/fxgfQc.cl:224:24: warning: multiple unsequenced modifications to 'p'1150/tmp/fxgfQc.cl:441:15: warning: multiple unsequenced modifications to 'p'1151 1152FAILED (cmp_all(1))1153 1154Failed to release test userptr object! (9) i915 kernel driver may not be sane!1155```1156 1157The only statements that may trigger that `multiple unsequenced modifications to 'p'` warning IMHO are1158```1159oldoffice_kernel.cl:194:                        W[i >> 1] = (uint)*p++ | (*p++ << 16U);1160oldoffice_kernel.cl:197:                        W[i >> 1] = (uint)*p++ | (*p++ << 16U);1161oldoffice_kernel.cl:210:                        W[i >> 1] = (uint)*p++ | (*p++ << 16U);1162oldoffice_kernel.cl:224:                        W[i >> 1] = (uint)*p++ | (*p++ << 16U);1163oldoffice_kernel.cl:408:                        uint u = *p++ | (*p++ << 16U);1164oldoffice_kernel.cl:413:                        uint u = *p++ | (*p++ << 16U);1165oldoffice_kernel.cl:426:                        uint u = *p++ | (*p++ << 16U);1166oldoffice_kernel.cl:441:                        uint u = *p++ | (*p++ << 16U);1167```1168Can any of the above be a problem?1169 1170 1171 1172I hope that these warnings1173```1174Failed to release test userptr object! (9) i915 kernel driver may not be sane!1175Failed to release test userptr object! (9) i915 kernel driver may not be sane!1176```1177will disappear after a future libdrm or linux kernel upgrade and that the1178```1179drm_intel_gem_bo_context_exec() failed: Invalid argument1180```1181problem will be fixed in future beignet versions.1182 1183May be when I get rid of the `disable atomic in L3 feature` due to the failed self test and when I disable the debug CFLAGS from my beignet build, the performance will improve...1184 1185For now, I just use OCL_IGNORE_SELF_TEST=1, otherwise the Haswell GPU will be skipped:1186```1187$ ./john --list=opencl-devices 1188Failed to release test userptr object! (9) i915 kernel driver may not be sane!1189Failed to release test userptr object! (9) i915 kernel driver may not be sane!1190drm_intel_gem_bo_context_exec() failed: Invalid argument1191Failed to release test userptr object! (9) i915 kernel driver may not be sane!1192Beignet: self-test failed: (3, 7, 5) + (5, 7, 3) returned (3, 7, 5)1193See README.md or http://www.freedesktop.org/wiki/Software/Beignet/1194Beignet: warning - disable atomic in L3 feature.1195Beignet: disabling non-working device1196OpenCL error (CL_DEVICE_NOT_FOUND) in file (common-opencl.c) at line (385) - (No OpenCL device of that type exist)1197```1198 1199```1200$ OCL_IGNORE_SELF_TEST=1 ./john --list=opencl-devices             

Showing the first 1,200 of 6790 lines. Download the file for the rest.