Team Ai
Modelpublic

karths/binary_classification_train_reli

sourceHugging Faceupdated 4mo agoView on Hugging Face
0likes369downloads
test_top_repo_data.csv22920 linesDownload Raw Back to root
1Unnamed: 0,id,type,created_at,repo,repo_url,action,title,labels,body,index,text_combine,label,text,binary_label255274,6461619830.0,IssuesEvent,2017-08-16 08:37:06,dotnet/corefx,https://api.github.com/repos/dotnet/corefx,closed,"Test: System.Runtime.Serialization.Formatters.Tests.BinaryFormatterTests/Roundtrip_Exceptions failed with ""System.Runtime.Serialization.SerializationException""",area-System.Runtime test-run-uwp-ilc,"Opened on behalf of @Jiayili13 4The test `System.Runtime.Serialization.Formatters.Tests.BinaryFormatterTests/Roundtrip_Exceptions(expected: System.AggregateException: Aggregate exception message (Exception message) ---> System.Excepti...` has failed.5 6System.Runtime.Serialization.SerializationException : Type '$BlockedFromReflection_0_6907734b' in Assembly 'System.Private.CoreLib, Version=4.0.0.0, Culture=neutral, PublicKeyToken=b03f5f7f11d50a3a' is not marked as serializable.7 8        Stack Trace:9 10           at System.Runtime.Serialization.FormatterServices.InternalGetSerializableMembers(Type type) in E:\A\_work\441\s\corefx\src\System.Runtime.Serialization.Formatters\src\System\Runtime\Serialization\FormatterServices.cs:line 8211       at System.Runtime.Serialization.FormatterServices.<>c.<GetSerializableMembers>b__5_0($MemberHolder mh) in E:\A\_work\441\s\corefx\src\System.Runtime.Serialization.Formatters\src\System\Runtime\Serialization\FormatterServices.cs:line 17712       at System.Func$2<System.Int32,System.__Canon>.Invoke(Int32 arg) in Invoke:line 1670756613       at System.Collections.Concurrent.ConcurrentDictionary$2<System.__Canon,System.__Canon>.GetOrAdd(__Canon key, Func$2<__Canon,__Canon> valueFactory) in E:\A\_work\441\s\corefx\src\System.Collections.Concurrent\src\System\Collections\Concurrent\ConcurrentDictionary.cs:line 98914       at System.Runtime.Serialization.FormatterServices.GetSerializableMembers(Type type, StreamingContext context) in E:\A\_work\441\s\corefx\src\System.Runtime.Serialization.Formatters\src\System\Runtime\Serialization\FormatterServices.cs:line 17515       at System.Runtime.Serialization.Formatters.Binary.WriteObjectInfo.InitMemberInfo() in E:\A\_work\441\s\corefx\src\System.Runtime.Serialization.Formatters\src\System\Runtime\Serialization\Formatters\Binary\BinaryObjectInfo.cs:line 24216       at System.Runtime.Serialization.Formatters.Binary.WriteObjectInfo.InitSerialize(Object obj, $ISurrogateSelector surrogateSelector, StreamingContext context, $SerObjectInfoInit serObjectInfoInit, IFormatterConverter converter, $ObjectWriter objectWriter, $SerializationBinder binder) in E:\A\_work\441\s\corefx\src\System.Runtime.Serialization.Formatters\src\System\Runtime\Serialization\Formatters\Binary\BinaryObjectInfo.cs:line 11517       at System.Runtime.Serialization.Formatters.Binary.WriteObjectInfo.Serialize(Object obj, $ISurrogateSelector surrogateSelector, StreamingContext context, $SerObjectInfoInit serObjectInfoInit, IFormatterConverter converter, $ObjectWriter objectWriter, $SerializationBinder binder) in E:\A\_work\441\s\corefx\src\System.Runtime.Serialization.Formatters\src\System\Runtime\Serialization\Formatters\Binary\BinaryObjectInfo.cs:line 7018       at System.Runtime.Serialization.Formatters.Binary.ObjectWriter.Write($WriteObjectInfo objectInfo, $NameInfo memberNameInfo, $NameInfo typeNameInfo) in E:\A\_work\441\s\corefx\src\System.Runtime.Serialization.Formatters\src\System\Runtime\Serialization\Formatters\Binary\BinaryObjectWriter.cs:line 17419       at System.Runtime.Serialization.Formatters.Binary.ObjectWriter.Serialize(Object graph, $BinaryFormatterWriter serWriter, Boolean fCheck) in E:\A\_work\441\s\corefx\src\System.Runtime.Serialization.Formatters\src\System\Runtime\Serialization\Formatters\Binary\BinaryObjectWriter.cs:line 9820       at System.Runtime.Serialization.Formatters.Binary.BinaryFormatter.Serialize(Stream serializationStream, Object graph, Boolean check) in E:\A\_work\441\s\corefx\src\System.Runtime.Serialization.Formatters\src\System\Runtime\Serialization\Formatters\Binary\BinaryFormatter.cs:line 8721       at System.Runtime.Serialization.Formatters.Tests.BinaryFormatterHelpers.Clone<System.__Canon>(__Canon obj) in E:\A\_work\441\s\corefx\src\Common\tests\System\Runtime\Serialization\Formatters\BinaryFormatterHelpers.cs:line 2122       at System.Runtime.Serialization.Formatters.Tests.BinaryFormatterHelpers.AssertRoundtrips<System.__Canon>(__Canon expected, __Canon[] additionalGetters) in E:\A\_work\441\s\corefx\src\Common\tests\System\Runtime\Serialization\Formatters\BinaryFormatterHelpers.cs:line 3923       at System.Runtime.Serialization.Formatters.Tests.BinaryFormatterTests.Roundtrip_Exceptions(Exception expected) in E:\A\_work\441\s\corefx\src\System.Runtime.Serialization.Formatters\tests\BinaryFormatterTests.cs:line 16824       at _$ILCT$.$ILT$ReflectionDynamicInvoke$.InvokeRetVI<System.__Canon>(Object thisPtr, IntPtr methodToCall, ArgSetupState argSetupState, Boolean targetIsThisCall)25       at System.InvokeUtils.CalliIntrinsics.Call(IntPtr dynamicInvokeHelperMethod, IntPtr dynamicInvokeHelperGenericDictionary, Object thisPtr, IntPtr methodToCall, ArgSetupState argSetupState, Boolean isTargetThisCall)26       at System.InvokeUtils.CallDynamicInvokeMethod(Object thisPtr, IntPtr methodToCall, Object thisPtrDynamicInvokeMethod, IntPtr dynamicInvokeHelperMethod, IntPtr dynamicInvokeHelperGenericDictionary, Object targetMethodOrDelegate, Object[] parameters, BinderBundle binderBundle, Boolean invokeMethodHelperIsThisCall, Boolean methodToCallIsThisCall) in CallDynamicInvokeMethod:line 1670756627    28Build : Master - 20170807.01 (UWP ILC Tests)29Failing configurations:30- Windows.10.Amd64.ClientRS3-x8631  - Debug32  - Release33- Windows.10.Amd64.ClientRS3-x6434  - Debug35  - Release36 37Detail: https://mc.dot.net/#/product/netcore/master/source/official~2Fcorefx~2Fmaster~2F/type/test~2Ffunctional~2Filc~2F/build/20170807.01/workItem/System.Runtime.Serialization.Formatters.Tests/analysis/xunit/System.Runtime.Serialization.Formatters.Tests.BinaryFormatterTests~2FRoundtrip_Exceptions(expected:%20System.AggregateException:%20Aggregate%20exception%20message%20(Exception%20message)%20---%3E%20System.Excepti...",1.0,"Test: System.Runtime.Serialization.Formatters.Tests.BinaryFormatterTests/Roundtrip_Exceptions failed with ""System.Runtime.Serialization.SerializationException"" - Opened on behalf of @Jiayili138 39The test `System.Runtime.Serialization.Formatters.Tests.BinaryFormatterTests/Roundtrip_Exceptions(expected: System.AggregateException: Aggregate exception message (Exception message) ---> System.Excepti...` has failed.40 41System.Runtime.Serialization.SerializationException : Type '$BlockedFromReflection_0_6907734b' in Assembly 'System.Private.CoreLib, Version=4.0.0.0, Culture=neutral, PublicKeyToken=b03f5f7f11d50a3a' is not marked as serializable.42 43        Stack Trace:44 45           at System.Runtime.Serialization.FormatterServices.InternalGetSerializableMembers(Type type) in E:\A\_work\441\s\corefx\src\System.Runtime.Serialization.Formatters\src\System\Runtime\Serialization\FormatterServices.cs:line 8246       at System.Runtime.Serialization.FormatterServices.<>c.<GetSerializableMembers>b__5_0($MemberHolder mh) in E:\A\_work\441\s\corefx\src\System.Runtime.Serialization.Formatters\src\System\Runtime\Serialization\FormatterServices.cs:line 17747       at System.Func$2<System.Int32,System.__Canon>.Invoke(Int32 arg) in Invoke:line 1670756648       at System.Collections.Concurrent.ConcurrentDictionary$2<System.__Canon,System.__Canon>.GetOrAdd(__Canon key, Func$2<__Canon,__Canon> valueFactory) in E:\A\_work\441\s\corefx\src\System.Collections.Concurrent\src\System\Collections\Concurrent\ConcurrentDictionary.cs:line 98949       at System.Runtime.Serialization.FormatterServices.GetSerializableMembers(Type type, StreamingContext context) in E:\A\_work\441\s\corefx\src\System.Runtime.Serialization.Formatters\src\System\Runtime\Serialization\FormatterServices.cs:line 17550       at System.Runtime.Serialization.Formatters.Binary.WriteObjectInfo.InitMemberInfo() in E:\A\_work\441\s\corefx\src\System.Runtime.Serialization.Formatters\src\System\Runtime\Serialization\Formatters\Binary\BinaryObjectInfo.cs:line 24251       at System.Runtime.Serialization.Formatters.Binary.WriteObjectInfo.InitSerialize(Object obj, $ISurrogateSelector surrogateSelector, StreamingContext context, $SerObjectInfoInit serObjectInfoInit, IFormatterConverter converter, $ObjectWriter objectWriter, $SerializationBinder binder) in E:\A\_work\441\s\corefx\src\System.Runtime.Serialization.Formatters\src\System\Runtime\Serialization\Formatters\Binary\BinaryObjectInfo.cs:line 11552       at System.Runtime.Serialization.Formatters.Binary.WriteObjectInfo.Serialize(Object obj, $ISurrogateSelector surrogateSelector, StreamingContext context, $SerObjectInfoInit serObjectInfoInit, IFormatterConverter converter, $ObjectWriter objectWriter, $SerializationBinder binder) in E:\A\_work\441\s\corefx\src\System.Runtime.Serialization.Formatters\src\System\Runtime\Serialization\Formatters\Binary\BinaryObjectInfo.cs:line 7053       at System.Runtime.Serialization.Formatters.Binary.ObjectWriter.Write($WriteObjectInfo objectInfo, $NameInfo memberNameInfo, $NameInfo typeNameInfo) in E:\A\_work\441\s\corefx\src\System.Runtime.Serialization.Formatters\src\System\Runtime\Serialization\Formatters\Binary\BinaryObjectWriter.cs:line 17454       at System.Runtime.Serialization.Formatters.Binary.ObjectWriter.Serialize(Object graph, $BinaryFormatterWriter serWriter, Boolean fCheck) in E:\A\_work\441\s\corefx\src\System.Runtime.Serialization.Formatters\src\System\Runtime\Serialization\Formatters\Binary\BinaryObjectWriter.cs:line 9855       at System.Runtime.Serialization.Formatters.Binary.BinaryFormatter.Serialize(Stream serializationStream, Object graph, Boolean check) in E:\A\_work\441\s\corefx\src\System.Runtime.Serialization.Formatters\src\System\Runtime\Serialization\Formatters\Binary\BinaryFormatter.cs:line 8756       at System.Runtime.Serialization.Formatters.Tests.BinaryFormatterHelpers.Clone<System.__Canon>(__Canon obj) in E:\A\_work\441\s\corefx\src\Common\tests\System\Runtime\Serialization\Formatters\BinaryFormatterHelpers.cs:line 2157       at System.Runtime.Serialization.Formatters.Tests.BinaryFormatterHelpers.AssertRoundtrips<System.__Canon>(__Canon expected, __Canon[] additionalGetters) in E:\A\_work\441\s\corefx\src\Common\tests\System\Runtime\Serialization\Formatters\BinaryFormatterHelpers.cs:line 3958       at System.Runtime.Serialization.Formatters.Tests.BinaryFormatterTests.Roundtrip_Exceptions(Exception expected) in E:\A\_work\441\s\corefx\src\System.Runtime.Serialization.Formatters\tests\BinaryFormatterTests.cs:line 16859       at _$ILCT$.$ILT$ReflectionDynamicInvoke$.InvokeRetVI<System.__Canon>(Object thisPtr, IntPtr methodToCall, ArgSetupState argSetupState, Boolean targetIsThisCall)60       at System.InvokeUtils.CalliIntrinsics.Call(IntPtr dynamicInvokeHelperMethod, IntPtr dynamicInvokeHelperGenericDictionary, Object thisPtr, IntPtr methodToCall, ArgSetupState argSetupState, Boolean isTargetThisCall)61       at System.InvokeUtils.CallDynamicInvokeMethod(Object thisPtr, IntPtr methodToCall, Object thisPtrDynamicInvokeMethod, IntPtr dynamicInvokeHelperMethod, IntPtr dynamicInvokeHelperGenericDictionary, Object targetMethodOrDelegate, Object[] parameters, BinderBundle binderBundle, Boolean invokeMethodHelperIsThisCall, Boolean methodToCallIsThisCall) in CallDynamicInvokeMethod:line 1670756662    63Build : Master - 20170807.01 (UWP ILC Tests)64Failing configurations:65- Windows.10.Amd64.ClientRS3-x8666  - Debug67  - Release68- Windows.10.Amd64.ClientRS3-x6469  - Debug70  - Release71 72Detail: https://mc.dot.net/#/product/netcore/master/source/official~2Fcorefx~2Fmaster~2F/type/test~2Ffunctional~2Filc~2F/build/20170807.01/workItem/System.Runtime.Serialization.Formatters.Tests/analysis/xunit/System.Runtime.Serialization.Formatters.Tests.BinaryFormatterTests~2FRoundtrip_Exceptions(expected:%20System.AggregateException:%20Aggregate%20exception%20message%20(Exception%20message)%20---%3E%20System.Excepti...",0,test  system runtime serialization formatters tests binaryformattertests roundtrip exceptions failed with  system runtime serialization serializationexception    opened on behalf of     the test  system runtime serialization formatters tests binaryformattertests roundtrip exceptions expected  system aggregateexception  aggregate exception message  exception message       system excepti     has failed   system runtime serialization serializationexception   type   blockedfromreflection      in assembly  system private corelib  version          culture neutral  publickeytoken    is not marked as serializable           stack trace              at system runtime serialization formatterservices internalgetserializablemembers type type  in e  a  work   s corefx src system runtime serialization formatters src system runtime serialization formatterservices cs line          at system runtime serialization formatterservices  c  b       memberholder mh  in e  a  work   s corefx src system runtime serialization formatters src system runtime serialization formatterservices cs line          at system func    invoke   arg  in invoke line          at system collections concurrent concurrentdictionary    getoradd   canon key  func    valuefactory  in e  a  work   s corefx src system collections concurrent src system collections concurrent concurrentdictionary cs line          at system runtime serialization formatterservices getserializablemembers type type  streamingcontext context  in e  a  work   s corefx src system runtime serialization formatters src system runtime serialization formatterservices cs line          at system runtime serialization formatters binary writeobjectinfo initmemberinfo   in e  a  work   s corefx src system runtime serialization formatters src system runtime serialization formatters binary binaryobjectinfo cs line          at system runtime serialization formatters binary writeobjectinfo initserialize object obj   isurrogateselector surrogateselector  streamingcontext context   serobjectinfoinit serobjectinfoinit  iformatterconverter converter   objectwriter objectwriter   serializationbinder binder  in e  a  work   s corefx src system runtime serialization formatters src system runtime serialization formatters binary binaryobjectinfo cs line          at system runtime serialization formatters binary writeobjectinfo serialize object obj   isurrogateselector surrogateselector  streamingcontext context   serobjectinfoinit serobjectinfoinit  iformatterconverter converter   objectwriter objectwriter   serializationbinder binder  in e  a  work   s corefx src system runtime serialization formatters src system runtime serialization formatters binary binaryobjectinfo cs line          at system runtime serialization formatters binary objectwriter write  writeobjectinfo objectinfo   nameinfo membernameinfo   nameinfo typenameinfo  in e  a  work   s corefx src system runtime serialization formatters src system runtime serialization formatters binary binaryobjectwriter cs line          at system runtime serialization formatters binary objectwriter serialize object graph   binaryformatterwriter serwriter  boolean fcheck  in e  a  work   s corefx src system runtime serialization formatters src system runtime serialization formatters binary binaryobjectwriter cs line          at system runtime serialization formatters binary binaryformatter serialize stream serializationstream  object graph  boolean check  in e  a  work   s corefx src system runtime serialization formatters src system runtime serialization formatters binary binaryformatter cs line          at system runtime serialization formatters tests binaryformatterhelpers clone    canon obj  in e  a  work   s corefx src common tests system runtime serialization formatters binaryformatterhelpers cs line          at system runtime serialization formatters tests binaryformatterhelpers assertroundtrips    canon expected    canon  additionalgetters  in e  a  work   s corefx src common tests system runtime serialization formatters binaryformatterhelpers cs line          at system runtime serialization formatters tests binaryformattertests roundtrip exceptions exception expected  in e  a  work   s corefx src system runtime serialization formatters tests binaryformattertests cs line          at   ilct   ilt reflectiondynamicinvoke  invokeretvi  object thisptr  intptr methodtocall  argsetupstate argsetupstate  boolean targetisthiscall         at system invokeutils calliintrinsics call intptr dynamicinvokehelpermethod  intptr dynamicinvokehelpergenericdictionary  object thisptr  intptr methodtocall  argsetupstate argsetupstate  boolean istargetthiscall         at system invokeutils calldynamicinvokemethod object thisptr  intptr methodtocall  object thisptrdynamicinvokemethod  intptr dynamicinvokehelpermethod  intptr dynamicinvokehelpergenericdictionary  object targetmethodordelegate  object  parameters  binderbundle binderbundle  boolean invokemethodhelperisthiscall  boolean methodtocallisthiscall  in calldynamicinvokemethod line        build   master        uwp ilc tests  failing configurations    windows             debug     release   windows             debug     release  detail   ,07319378,4386435226.0,IssuesEvent,2016-08-08 12:50:40,sinonjs/sinon,https://api.github.com/repos/sinonjs/sinon,opened,Create an article on how ES2015 classes relate to stubbing/spying,Documentation,"A couple of issues with a huge pile of comments shows there is some confusion as to how (if at all possible) one can stub constructors in ES6/ES2015 classes. This has been answered in the comments, but it should be expanded to an article showing what can and cannot be done.",1.0,"Create an article on how ES2015 classes relate to stubbing/spying - A couple of issues with a huge pile of comments shows there is some confusion as to how (if at all possible) one can stub constructors in ES6/ES2015 classes. This has been answered in the comments, but it should be expanded to an article showing what can and cannot be done.",0,create an article on how   classes relate to stubbing spying   a couple of issues with a huge pile of comments shows there is some confusion as to how  if at all possible  one can stub constructors in     classes  this has been answered in the comments  but it should be expanded to an article showing what can and cannot be done ,07488,3720455256.0,IssuesEvent,2016-03-04 00:07:47,dotnet/roslyn,https://api.github.com/repos/dotnet/roslyn,opened,Iterator compilation crashes when IDisposable.Dispose isn't available,Area-Compilers Bug Tenet-Reliability,"The test below fails, but it should report diagnostics instead. To repro, make sure the corlib is missing IDisposable.Dispose and IEnumerable.MoveNext as those types will be added to the shared mincorlib shortly.  75This problem also exists with the VB compiler.76 77On the C# side, the exception is thrown by `Debug.Assert(useSiteDiagnostics.IsNullOrEmpty());` in `SyntheticBoundNodeFactory.Return(BoundExpression expression)` at SyntheticBoundNodeFactory.cs(426,0).78 79From discussion with Tomas and Neal, the way to fix this is to move the try/catch for missing predefined members around the call to the rewriter and emit a `throw null` instead. The try/catch is currently in `IteratorRewriter.GenerateMethodImplementations()`.80 81 82```C#83        public void IteratorRequireSpecialKnownTypesInCorLib()84        {85            // IDisposable.Dispose and IEnumerable.MoveNext86 87            var source =88@""89public class C90{91    public System.Collections.IEnumerable SomeNumbers() 92    {93        yield return 42;94    }95}"";96            var comp = CreateCompilation(new[] { Parse(source) }, new[] { TestReferences.NetFx.Minimal.mincorlib });97            CompileAndVerify(comp);98        }99```100 101This was discovered while investigating #9167, which is about compiling async and iterator methods in VB while missing expected types.",True,"Iterator compilation crashes when IDisposable.Dispose isn't available - The test below fails, but it should report diagnostics instead. To repro, make sure the corlib is missing IDisposable.Dispose and IEnumerable.MoveNext as those types will be added to the shared mincorlib shortly.  102This problem also exists with the VB compiler.103 104On the C# side, the exception is thrown by `Debug.Assert(useSiteDiagnostics.IsNullOrEmpty());` in `SyntheticBoundNodeFactory.Return(BoundExpression expression)` at SyntheticBoundNodeFactory.cs(426,0).105 106From discussion with Tomas and Neal, the way to fix this is to move the try/catch for missing predefined members around the call to the rewriter and emit a `throw null` instead. The try/catch is currently in `IteratorRewriter.GenerateMethodImplementations()`.107 108 109```C#110        public void IteratorRequireSpecialKnownTypesInCorLib()111        {112            // IDisposable.Dispose and IEnumerable.MoveNext113 114            var source =115@""116public class C117{118    public System.Collections.IEnumerable SomeNumbers() 119    {120        yield return 42;121    }122}"";123            var comp = CreateCompilation(new[] { Parse(source) }, new[] { TestReferences.NetFx.Minimal.mincorlib });124            CompileAndVerify(comp);125        }126```127 128This was discovered while investigating #9167, which is about compiling async and iterator methods in VB while missing expected types.",1,iterator compilation crashes when idisposable dispose isn t available   the test below fails  but it should report diagnostics instead  to repro  make sure the corlib is missing idisposable dispose and ienumerable movenext as those types will be added to the shared mincorlib shortly     this problem also exists with the vb compiler     on the c  side  the exception is thrown by  debug assert usesitediagnostics isnullorempty      in  syntheticboundnodefactory return boundexpression expression   at syntheticboundnodefactory cs          from discussion with tomas and neal  the way to fix this is to move the try catch for missing predefined members around the call to the rewriter and emit a  throw null  instead  the try catch is currently in  iteratorrewriter generatemethodimplementations             c           public void iteratorrequirespecialknowntypesincorlib                              idisposable dispose and ienumerable movenext                var source        public class c         public system collections ienumerable somenumbers                    yield return                             var comp   createcompilation new    parse source     new    testreferences netfx minimal mincorlib                  compileandverify comp                      this was discovered while investigating     which is about compiling async and iterator methods in vb while missing expected types ,1129301226,9217828655.0,IssuesEvent,2019-03-11 11:48:53,webcompat/web-bugs,https://api.github.com/repos/webcompat/web-bugs,closed,outlook.live.com - site is not usable,browser-firefox-mobile browser-focus-geckoview priority-critical,"<!-- @browser: Firefox Mobile 65.0 -->130<!-- @ua_header: Mozilla/5.0 (Android 8.0.0; Mobile; rv:65.0) Gecko/65.0 Firefox/65.0 -->131<!-- @reported_with:  -->132<!-- @extra_labels: browser-focus-geckoview -->133 134**URL**: https://outlook.live.com/135 136**Browser / Version**: Firefox Mobile 65.0137**Operating System**: Android 8.0.0138**Tested Another Browser**: Yes139 140**Problem type**: Site is not usable141**Description**: won't connect142**Steps to Reproduce**:143Attempted to remove site tracking 144 145<details>146<summary>Browser Configuration</summary>147<ul>148  <li>None</li>149</ul>150 151</details>152 153_From [webcompat.com](https://webcompat.com/) with ❤️_",1.0,"outlook.live.com - site is not usable - <!-- @browser: Firefox Mobile 65.0 -->154<!-- @ua_header: Mozilla/5.0 (Android 8.0.0; Mobile; rv:65.0) Gecko/65.0 Firefox/65.0 -->155<!-- @reported_with:  -->156<!-- @extra_labels: browser-focus-geckoview -->157 158**URL**: https://outlook.live.com/159 160**Browser / Version**: Firefox Mobile 65.0161**Operating System**: Android 8.0.0162**Tested Another Browser**: Yes163 164**Problem type**: Site is not usable165**Description**: won't connect166**Steps to Reproduce**:167Attempted to remove site tracking 168 169<details>170<summary>Browser Configuration</summary>171<ul>172  <li>None</li>173</ul>174 175</details>176 177_From [webcompat.com](https://webcompat.com/) with ❤️_",0,outlook live com   site is not usable              url         browser   version    firefox mobile       operating system    android         tested another browser    yes    problem type    site is not usable   description    won t connect   steps to reproduce    attempted to remove site tracking      browser configuration       none         from     with ❤️ ,0178174565,27663430038.0,IssuesEvent,2023-03-12 19:37:04,APPSCHOOL1-REPO/finalproject-gitspace,https://api.github.com/repos/APPSCHOOL1-REPO/finalproject-gitspace,closed,[Design] GSTextEditor 디자인 시스템의 색상 값을 변경합니다,🎨 Design 🛠️ Fix,"### 📝 작업 목적179- 디자인 컨펌 결과를 TextEditor 색상에 반영하고, ColorScheme 조건을 Asset의 Darkmode 색상으로 변경합니다180 181---182 183### 🛠️ Tasks184 185* [x] 돋보기 아이콘 색상 변경186* [x] TextEditor 백그라운드 색상 변경187* [x] ColorScheme 삼항 연산자 제거188",1.0,"[Design] GSTextEditor 디자인 시스템의 색상 값을 변경합니다 - ### 📝 작업 목적189- 디자인 컨펌 결과를 TextEditor 색상에 반영하고, ColorScheme 조건을 Asset의 Darkmode 색상으로 변경합니다190 191---192 193### 🛠️ Tasks194 195* [x] 돋보기 아이콘 색상 변경196* [x] TextEditor 백그라운드 색상 변경197* [x] ColorScheme 삼항 연산자 제거198",0,  gstexteditor 디자인 시스템의 색상 값을 변경합니다       📝 작업 목적    디자인 컨펌 결과를 texteditor 색상에 반영하고  colorscheme 조건을 asset의 darkmode 색상으로 변경합니다               🛠️ tasks        돋보기 아이콘 색상 변경      texteditor 백그라운드 색상 변경      colorscheme 삼항 연산자 제거  ,0199998,12059082966.0,IssuesEvent,2020-04-15 18:37:45,dotnet/roslyn,https://api.github.com/repos/dotnet/roslyn,closed,SqlConnection.Finalize can cause crashes,Area-IDE Bug Resolution-Fixed Tenet-Reliability,"**Version Used**: Builds as new as 15.0.26730.15200 201:link: Internal issue: [DevDiv 490079](https://devdiv.visualstudio.com/DevDiv/_workitems/edit/490079)202 203**Steps to Reproduce**:204 205Unknown206 207**Expected Behavior**:208 209`SqlConnection` instances are not finalized.210 211**Actual Behavior**:212 213`SqlConnection.Finalize()` is getting called on an unknown code path, resulting in a crash.214 215:memo: This was supposed to be corrected by #20806, but it's still showing up.",True,"SqlConnection.Finalize can cause crashes - **Version Used**: Builds as new as 15.0.26730.15216 217:link: Internal issue: [DevDiv 490079](https://devdiv.visualstudio.com/DevDiv/_workitems/edit/490079)218 219**Steps to Reproduce**:220 221Unknown222 223**Expected Behavior**:224 225`SqlConnection` instances are not finalized.226 227**Actual Behavior**:228 229`SqlConnection.Finalize()` is getting called on an unknown code path, resulting in a crash.230 231:memo: This was supposed to be corrected by #20806, but it's still showing up.",1,sqlconnection finalize can cause crashes     version used    builds as new as             link  internal issue           steps to reproduce       unknown      expected behavior        sqlconnection  instances are not finalized       actual behavior        sqlconnection finalize    is getting called on an unknown code path  resulting in a crash      memo  this was supposed to be corrected by     but it s still showing up ,1232270444,8460435184.0,IssuesEvent,2018-10-22 18:50:25,CDCgov/WebMicrobeTrace,https://api.github.com/repos/CDCgov/WebMicrobeTrace,opened,Add Additional Genetic Distance Models,enhancement low priority,"e.g.:233* 0-1 Normalized SNPs234* [Euclidean Distance](https://en.wikipedia.org/wiki/Euclidean_distance)235 236See [Wikipedia: Models of DNA Evolution](https://en.wikipedia.org/wiki/Models_of_DNA_evolution) for more",1.0,"Add Additional Genetic Distance Models - e.g.:237* 0-1 Normalized SNPs238* [Euclidean Distance](https://en.wikipedia.org/wiki/Euclidean_distance)239 240See [Wikipedia: Models of DNA Evolution](https://en.wikipedia.org/wiki/Models_of_DNA_evolution) for more",0,add additional genetic distance models   e g          normalized snps           see     for more,02412375,24988352405.0,IssuesEvent,2022-11-02 16:39:39,dotnet/roslyn,https://api.github.com/repos/dotnet/roslyn,closed,Assertion failure in RemoveUnusedMembers.AbstractRemoveUnusedMembersDiagnosticAnalyzer`2,Bug help wanted Area-IDE Tenet-Reliability,"```242---------------------------243Assertion Failed: Abort=Quit, Retry=Debug, Ignore=Continue244---------------------------245   at Microsoft.CodeAnalysis.RemoveUnusedMembers.AbstractRemoveUnusedMembersDiagnosticAnalyzer`2.CompilationAnalyzer.IsCandidateSymbol(ISymbol memberSymbol) in C:\R5\src\Analyzers\Core\Analyzers\RemoveUnusedMembers\AbstractRemoveUnusedMembersDiagnosticAnalyzer.cs:line 593246 247   at Microsoft.CodeAnalysis.RemoveUnusedMembers.AbstractRemoveUnusedMembersDiagnosticAnalyzer`2.CompilationAnalyzer.GetCandidateSymbolsReferencedInDocComments(INamedTypeSymbol namedTypeSymbol, Compilation compilation, CancellationToken cancellationToken) in C:\R5\src\Analyzers\Core\Analyzers\RemoveUnusedMembers\AbstractRemoveUnusedMembersDiagnosticAnalyzer.cs:line 523248 249   at Microsoft.CodeAnalysis.RemoveUnusedMembers.AbstractRemoveUnusedMembersDiagnosticAnalyzer`2.CompilationAnalyzer.OnSymbolEnd(SymbolAnalysisContext symbolEndContext, Boolean hasUnsupportedOperation) in C:\R5\src\Analyzers\Core\Analyzers\RemoveUnusedMembers\AbstractRemoveUnusedMembersDiagnosticAnalyzer.cs:line 414250 251   at Microsoft.CodeAnalysis.RemoveUnusedMembers.Ab......252 253```254 255Dumps: `\\mlangfs1\public\tomat\Bugs\diagassert`",True,"Assertion failure in RemoveUnusedMembers.AbstractRemoveUnusedMembersDiagnosticAnalyzer`2 - ```256---------------------------257Assertion Failed: Abort=Quit, Retry=Debug, Ignore=Continue258---------------------------259   at Microsoft.CodeAnalysis.RemoveUnusedMembers.AbstractRemoveUnusedMembersDiagnosticAnalyzer`2.CompilationAnalyzer.IsCandidateSymbol(ISymbol memberSymbol) in C:\R5\src\Analyzers\Core\Analyzers\RemoveUnusedMembers\AbstractRemoveUnusedMembersDiagnosticAnalyzer.cs:line 593260 261   at Microsoft.CodeAnalysis.RemoveUnusedMembers.AbstractRemoveUnusedMembersDiagnosticAnalyzer`2.CompilationAnalyzer.GetCandidateSymbolsReferencedInDocComments(INamedTypeSymbol namedTypeSymbol, Compilation compilation, CancellationToken cancellationToken) in C:\R5\src\Analyzers\Core\Analyzers\RemoveUnusedMembers\AbstractRemoveUnusedMembersDiagnosticAnalyzer.cs:line 523262 263   at Microsoft.CodeAnalysis.RemoveUnusedMembers.AbstractRemoveUnusedMembersDiagnosticAnalyzer`2.CompilationAnalyzer.OnSymbolEnd(SymbolAnalysisContext symbolEndContext, Boolean hasUnsupportedOperation) in C:\R5\src\Analyzers\Core\Analyzers\RemoveUnusedMembers\AbstractRemoveUnusedMembersDiagnosticAnalyzer.cs:line 414264 265   at Microsoft.CodeAnalysis.RemoveUnusedMembers.Ab......266 267```268 269Dumps: `\\mlangfs1\public\tomat\Bugs\diagassert`",1,assertion failure in removeunusedmembers abstractremoveunusedmembersdiagnosticanalyzer                                       assertion failed  abort quit  retry debug  ignore continue                                  at microsoft codeanalysis removeunusedmembers abstractremoveunusedmembersdiagnosticanalyzer   compilationanalyzer iscandidatesymbol isymbol membersymbol  in c    src analyzers core analyzers removeunusedmembers abstractremoveunusedmembersdiagnosticanalyzer cs line         at microsoft codeanalysis removeunusedmembers abstractremoveunusedmembersdiagnosticanalyzer   compilationanalyzer getcandidatesymbolsreferencedindoccomments inamedtypesymbol namedtypesymbol  compilation compilation  cancellationtoken cancellationtoken  in c    src analyzers core analyzers removeunusedmembers abstractremoveunusedmembersdiagnosticanalyzer cs line         at microsoft codeanalysis removeunusedmembers abstractremoveunusedmembersdiagnosticanalyzer   compilationanalyzer onsymbolend symbolanalysiscontext symbolendcontext  boolean hasunsupportedoperation  in c    src analyzers core analyzers removeunusedmembers abstractremoveunusedmembersdiagnosticanalyzer cs line         at microsoft codeanalysis removeunusedmembers ab                 dumps       public tomat bugs diagassert ,1270110,4013957860.0,IssuesEvent,2016-05-14 00:11:48,dotnet/roslyn,https://api.github.com/repos/dotnet/roslyn,closed,IDE crashes when renaming a local (SymbolKey.NonDeclarationSymbolKey'1.EnumerateSymbols),Area-IDE Bug Tenet-Reliability," VS crashed a few times and I captured some crash dumps. The callstack points to `SymbolKey.NonDeclarationSymbolKey'1.EnumerateSymbols`. I managed to catch it in a debugger and it is the `compilation` parameter that is null.271 272![null-ref](https://cloud.githubusercontent.com/assets/12466233/15088371/86cc7f80-13a7-11e6-83c1-5f87ca236536.png)273 274 275```276Microsoft.CodeAnalysis.Workspaces.dll!Microsoft.CodeAnalysis.SymbolKey.NonDeclarationSymbolKey<Microsoft.CodeAnalysis.ILocalSymbol>.EnumerateSymbols(Microsoft.CodeAnalysis.Compilation compilation, Microsoft.CodeAnalysis.ISymbol containingSymbol, string name, System.Threading.CancellationToken cancellationToken) Line 75           C#277Microsoft.CodeAnalysis.Workspaces.dll!Microsoft.CodeAnalysis.SymbolKey.NonDeclarationSymbolKey<Microsoft.CodeAnalysis.ILocalSymbol>.NonDeclarationSymbolKey(Microsoft.CodeAnalysis.ILocalSymbol symbol, Microsoft.CodeAnalysis.SymbolKey.Visitor visitor) Line 33             C#278Microsoft.CodeAnalysis.Workspaces.dll!Microsoft.CodeAnalysis.SymbolKey.Visitor.VisitLocal(Microsoft.CodeAnalysis.ILocalSymbol localSymbol) Line 59       C#279Microsoft.CodeAnalysis.CSharp.dll!Microsoft.CodeAnalysis.CSharp.Symbols.LocalSymbol.Accept<System.__Canon>(Microsoft.CodeAnalysis.SymbolVisitor<System.__Canon> visitor)  Unknown280Microsoft.CodeAnalysis.Workspaces.dll!Microsoft.CodeAnalysis.SymbolKey.GetOrCreate(Microsoft.CodeAnalysis.ISymbol symbol, Microsoft.CodeAnalysis.SymbolKey.Visitor visitor) Line 121           C#281> Microsoft.CodeAnalysis.Workspaces.dll!Microsoft.CodeAnalysis.FindSymbols.SymbolFinder.FindSourceDefinitionWorkerAsync(Microsoft.CodeAnalysis.ISymbol symbol, Microsoft.CodeAnalysis.Solution solution, System.Threading.CancellationToken cancellationToken) Line 149                C#282Microsoft.CodeAnalysis.Workspaces.dll!Microsoft.CodeAnalysis.FindSymbols.SymbolFinder.FindSourceDefinitionAsync(Microsoft.CodeAnalysis.ISymbol symbol, Microsoft.CodeAnalysis.Solution solution, System.Threading.CancellationToken cancellationToken) Line 87                C#283Microsoft.CodeAnalysis.EditorFeatures.dll!Microsoft.CodeAnalysis.Editor.Implementation.RenameTracking.RenameTrackingTaggerProvider.TrackingSession.DetermineIfRenamableSymbolAsync(Microsoft.CodeAnalysis.ISymbol symbol, Microsoft.CodeAnalysis.Document document, Microsoft.CodeAnalysis.SyntaxToken token)          Unknown284mscorlib.dll!System.Runtime.CompilerServices.AsyncTaskMethodBuilder<Microsoft.CodeAnalysis.Editor.Implementation.RenameTracking.RenameTrackingTaggerProvider.TriggerIdentifierKind>.Start<Microsoft.CodeAnalysis.Editor.Implementation.RenameTracking.RenameTrackingTaggerProvider.TrackingSession.<DetermineIfRenamableSymbolAsync>d__22>(ref Microsoft.CodeAnalysis.Editor.Implementation.RenameTracking.RenameTrackingTaggerProvider.TrackingSession.<DetermineIfRenamableSymbolAsync>d__22 stateMachine)  Unknown285Microsoft.CodeAnalysis.EditorFeatures.dll!Microsoft.CodeAnalysis.Editor.Implementation.RenameTracking.RenameTrackingTaggerProvider.TrackingSession.DetermineIfRenamableSymbolAsync(Microsoft.CodeAnalysis.ISymbol symbol, Microsoft.CodeAnalysis.Document document, Microsoft.CodeAnalysis.SyntaxToken token)          Unknown286Microsoft.CodeAnalysis.EditorFeatures.dll!Microsoft.CodeAnalysis.Editor.Implementation.RenameTracking.RenameTrackingTaggerProvider.TrackingSession.DetermineIfRenamableIdentifierAsync(Microsoft.VisualStudio.Text.SnapshotSpan snapshotSpan, bool initialCheck)               Unknown287mscorlib.dll!System.Runtime.CompilerServices.AsyncTaskMethodBuilder<Microsoft.CodeAnalysis.Editor.Implementation.RenameTracking.RenameTrackingTaggerProvider.TriggerIdentifierKind>.Start<Microsoft.CodeAnalysis.Editor.Implementation.RenameTracking.RenameTrackingTaggerProvider.TrackingSession.<DetermineIfRenamableIdentifierAsync>d__20>(ref Microsoft.CodeAnalysis.Editor.Implementation.RenameTracking.RenameTrackingTaggerProvider.TrackingSession.<DetermineIfRenamableIdentifierAsync>d__20 stateMachine)  Unknown288Microsoft.CodeAnalysis.EditorFeatures.dll!Microsoft.CodeAnalysis.Editor.Implementation.RenameTracking.RenameTrackingTaggerProvider.TrackingSession.DetermineIfRenamableIdentifierAsync(Microsoft.VisualStudio.Text.SnapshotSpan snapshotSpan, bool initialCheck)               Unknown289Microsoft.CodeAnalysis.EditorFeatures.dll!Microsoft.CodeAnalysis.Editor.Implementation.RenameTracking.RenameTrackingTaggerProvider.TrackingSession.CheckNewIdentifier.AnonymousMethod__0(System.Threading.Tasks.Task<Microsoft.CodeAnalysis.Editor.Implementation.RenameTracking.RenameTrackingTaggerProvider.TriggerIdentifierKind> t)             Unknown290mscorlib.dll!System.Runtime.CompilerServices.AsyncTaskMethodBuilder<bool>.Start<Microsoft.CodeAnalysis.Editor.Implementation.RenameTracking.RenameTrackingTaggerProvider.TrackingSession.(ref Microsoft.CodeAnalysis.Editor.Implementation.RenameTracking.RenameTrackingTaggerProvider.TrackingSession.<>c__DisplayClass17_0.<<CheckNewIdentifier>b__0>d stateMachine)  Unknown291Microsoft.CodeAnalysis.EditorFeatures.dll!Microsoft.CodeAnalysis.Editor.Implementation.RenameTracking.RenameTrackingTaggerProvider.TrackingSession.CheckNewIdentifier.AnonymousMethod__0(System.Threading.Tasks.Task<Microsoft.CodeAnalysis.Editor.Implementation.RenameTracking.RenameTrackingTaggerProvider.TriggerIdentifierKind> t)             Unknown292Microsoft.CodeAnalysis.Workspaces.dll!Roslyn.Utilities.TaskExtensions.SafeContinueWithFromAsync.AnonymousMethod__0(System.Threading.Tasks.Task antecedent) Line 253      C#293mscorlib.dll!System.Threading.Tasks.ContinuationResultTaskFromTask<System.Threading.Tasks.Task<bool>>.InnerInvoke()                Unknown294               mscorlib.dll!System.Threading.Tasks.Task.Execute()         Unknown295               mscorlib.dll!System.Threading.Tasks.Task.ExecutionContextCallback(object obj) Unknown296               mscorlib.dll!System.Threading.ExecutionContext.RunInternal(System.Threading.ExecutionContext executionContext, System.Threading.ContextCallback callback, object state, bool preserveSyncCtx)           Unknown297               mscorlib.dll!System.Threading.ExecutionContext.Run(System.Threading.ExecutionContext executionContext, System.Threading.ContextCallback callback, object state, bool preserveSyncCtx) Unknown298               mscorlib.dll!System.Threading.Tasks.Task.ExecuteWithThreadLocal(ref System.Threading.Tasks.Task currentTaskSlot)               Unknown299               mscorlib.dll!System.Threading.Tasks.Task.ExecuteEntry(bool bPreventDoubleExecution) Unknown300               mscorlib.dll!System.Threading.Tasks.Task.System.Threading.IThreadPoolWorkItem.ExecuteWorkItem()                Unknown301               mscorlib.dll!System.Threading.ThreadPoolWorkQueue.Dispatch()             Unknown302               mscorlib.dll!System.Threading._ThreadPoolWaitCallback.PerformWaitCallback() Unknown303 304```305 306The repro itself is to select `underlyingType` (squiggled in red below) and type `x`.307This is using VS2015 update 2.308 309![image](https://cloud.githubusercontent.com/assets/12466233/15088439/c7ff2f24-13a8-11e6-9b9b-af228c667122.png)310",True,"IDE crashes when renaming a local (SymbolKey.NonDeclarationSymbolKey'1.EnumerateSymbols) -  VS crashed a few times and I captured some crash dumps. The callstack points to `SymbolKey.NonDeclarationSymbolKey'1.EnumerateSymbols`. I managed to catch it in a debugger and it is the `compilation` parameter that is null.311 312![null-ref](https://cloud.githubusercontent.com/assets/12466233/15088371/86cc7f80-13a7-11e6-83c1-5f87ca236536.png)313 314 315```316Microsoft.CodeAnalysis.Workspaces.dll!Microsoft.CodeAnalysis.SymbolKey.NonDeclarationSymbolKey<Microsoft.CodeAnalysis.ILocalSymbol>.EnumerateSymbols(Microsoft.CodeAnalysis.Compilation compilation, Microsoft.CodeAnalysis.ISymbol containingSymbol, string name, System.Threading.CancellationToken cancellationToken) Line 75           C#317Microsoft.CodeAnalysis.Workspaces.dll!Microsoft.CodeAnalysis.SymbolKey.NonDeclarationSymbolKey<Microsoft.CodeAnalysis.ILocalSymbol>.NonDeclarationSymbolKey(Microsoft.CodeAnalysis.ILocalSymbol symbol, Microsoft.CodeAnalysis.SymbolKey.Visitor visitor) Line 33             C#318Microsoft.CodeAnalysis.Workspaces.dll!Microsoft.CodeAnalysis.SymbolKey.Visitor.VisitLocal(Microsoft.CodeAnalysis.ILocalSymbol localSymbol) Line 59       C#319Microsoft.CodeAnalysis.CSharp.dll!Microsoft.CodeAnalysis.CSharp.Symbols.LocalSymbol.Accept<System.__Canon>(Microsoft.CodeAnalysis.SymbolVisitor<System.__Canon> visitor)  Unknown320Microsoft.CodeAnalysis.Workspaces.dll!Microsoft.CodeAnalysis.SymbolKey.GetOrCreate(Microsoft.CodeAnalysis.ISymbol symbol, Microsoft.CodeAnalysis.SymbolKey.Visitor visitor) Line 121           C#321> Microsoft.CodeAnalysis.Workspaces.dll!Microsoft.CodeAnalysis.FindSymbols.SymbolFinder.FindSourceDefinitionWorkerAsync(Microsoft.CodeAnalysis.ISymbol symbol, Microsoft.CodeAnalysis.Solution solution, System.Threading.CancellationToken cancellationToken) Line 149                C#322Microsoft.CodeAnalysis.Workspaces.dll!Microsoft.CodeAnalysis.FindSymbols.SymbolFinder.FindSourceDefinitionAsync(Microsoft.CodeAnalysis.ISymbol symbol, Microsoft.CodeAnalysis.Solution solution, System.Threading.CancellationToken cancellationToken) Line 87                C#323Microsoft.CodeAnalysis.EditorFeatures.dll!Microsoft.CodeAnalysis.Editor.Implementation.RenameTracking.RenameTrackingTaggerProvider.TrackingSession.DetermineIfRenamableSymbolAsync(Microsoft.CodeAnalysis.ISymbol symbol, Microsoft.CodeAnalysis.Document document, Microsoft.CodeAnalysis.SyntaxToken token)          Unknown324mscorlib.dll!System.Runtime.CompilerServices.AsyncTaskMethodBuilder<Microsoft.CodeAnalysis.Editor.Implementation.RenameTracking.RenameTrackingTaggerProvider.TriggerIdentifierKind>.Start<Microsoft.CodeAnalysis.Editor.Implementation.RenameTracking.RenameTrackingTaggerProvider.TrackingSession.<DetermineIfRenamableSymbolAsync>d__22>(ref Microsoft.CodeAnalysis.Editor.Implementation.RenameTracking.RenameTrackingTaggerProvider.TrackingSession.<DetermineIfRenamableSymbolAsync>d__22 stateMachine)  Unknown325Microsoft.CodeAnalysis.EditorFeatures.dll!Microsoft.CodeAnalysis.Editor.Implementation.RenameTracking.RenameTrackingTaggerProvider.TrackingSession.DetermineIfRenamableSymbolAsync(Microsoft.CodeAnalysis.ISymbol symbol, Microsoft.CodeAnalysis.Document document, Microsoft.CodeAnalysis.SyntaxToken token)          Unknown326Microsoft.CodeAnalysis.EditorFeatures.dll!Microsoft.CodeAnalysis.Editor.Implementation.RenameTracking.RenameTrackingTaggerProvider.TrackingSession.DetermineIfRenamableIdentifierAsync(Microsoft.VisualStudio.Text.SnapshotSpan snapshotSpan, bool initialCheck)               Unknown327mscorlib.dll!System.Runtime.CompilerServices.AsyncTaskMethodBuilder<Microsoft.CodeAnalysis.Editor.Implementation.RenameTracking.RenameTrackingTaggerProvider.TriggerIdentifierKind>.Start<Microsoft.CodeAnalysis.Editor.Implementation.RenameTracking.RenameTrackingTaggerProvider.TrackingSession.<DetermineIfRenamableIdentifierAsync>d__20>(ref Microsoft.CodeAnalysis.Editor.Implementation.RenameTracking.RenameTrackingTaggerProvider.TrackingSession.<DetermineIfRenamableIdentifierAsync>d__20 stateMachine)  Unknown328Microsoft.CodeAnalysis.EditorFeatures.dll!Microsoft.CodeAnalysis.Editor.Implementation.RenameTracking.RenameTrackingTaggerProvider.TrackingSession.DetermineIfRenamableIdentifierAsync(Microsoft.VisualStudio.Text.SnapshotSpan snapshotSpan, bool initialCheck)               Unknown329Microsoft.CodeAnalysis.EditorFeatures.dll!Microsoft.CodeAnalysis.Editor.Implementation.RenameTracking.RenameTrackingTaggerProvider.TrackingSession.CheckNewIdentifier.AnonymousMethod__0(System.Threading.Tasks.Task<Microsoft.CodeAnalysis.Editor.Implementation.RenameTracking.RenameTrackingTaggerProvider.TriggerIdentifierKind> t)             Unknown330mscorlib.dll!System.Runtime.CompilerServices.AsyncTaskMethodBuilder<bool>.Start<Microsoft.CodeAnalysis.Editor.Implementation.RenameTracking.RenameTrackingTaggerProvider.TrackingSession.(ref Microsoft.CodeAnalysis.Editor.Implementation.RenameTracking.RenameTrackingTaggerProvider.TrackingSession.<>c__DisplayClass17_0.<<CheckNewIdentifier>b__0>d stateMachine)  Unknown331Microsoft.CodeAnalysis.EditorFeatures.dll!Microsoft.CodeAnalysis.Editor.Implementation.RenameTracking.RenameTrackingTaggerProvider.TrackingSession.CheckNewIdentifier.AnonymousMethod__0(System.Threading.Tasks.Task<Microsoft.CodeAnalysis.Editor.Implementation.RenameTracking.RenameTrackingTaggerProvider.TriggerIdentifierKind> t)             Unknown332Microsoft.CodeAnalysis.Workspaces.dll!Roslyn.Utilities.TaskExtensions.SafeContinueWithFromAsync.AnonymousMethod__0(System.Threading.Tasks.Task antecedent) Line 253      C#333mscorlib.dll!System.Threading.Tasks.ContinuationResultTaskFromTask<System.Threading.Tasks.Task<bool>>.InnerInvoke()                Unknown334               mscorlib.dll!System.Threading.Tasks.Task.Execute()         Unknown335               mscorlib.dll!System.Threading.Tasks.Task.ExecutionContextCallback(object obj) Unknown336               mscorlib.dll!System.Threading.ExecutionContext.RunInternal(System.Threading.ExecutionContext executionContext, System.Threading.ContextCallback callback, object state, bool preserveSyncCtx)           Unknown337               mscorlib.dll!System.Threading.ExecutionContext.Run(System.Threading.ExecutionContext executionContext, System.Threading.ContextCallback callback, object state, bool preserveSyncCtx) Unknown338               mscorlib.dll!System.Threading.Tasks.Task.ExecuteWithThreadLocal(ref System.Threading.Tasks.Task currentTaskSlot)               Unknown339               mscorlib.dll!System.Threading.Tasks.Task.ExecuteEntry(bool bPreventDoubleExecution) Unknown340               mscorlib.dll!System.Threading.Tasks.Task.System.Threading.IThreadPoolWorkItem.ExecuteWorkItem()                Unknown341               mscorlib.dll!System.Threading.ThreadPoolWorkQueue.Dispatch()             Unknown342               mscorlib.dll!System.Threading._ThreadPoolWaitCallback.PerformWaitCallback() Unknown343 344```345 346The repro itself is to select `underlyingType` (squiggled in red below) and type `x`.347This is using VS2015 update 2.348 349![image](https://cloud.githubusercontent.com/assets/12466233/15088439/c7ff2f24-13a8-11e6-9b9b-af228c667122.png)350",1,ide crashes when renaming a local  symbolkey nondeclarationsymbolkey   enumeratesymbols     vs crashed a few times and i captured some crash dumps  the callstack points to  symbolkey nondeclarationsymbolkey   enumeratesymbols   i managed to catch it in a debugger and it is the  compilation  parameter that is null                    microsoft codeanalysis workspaces dll microsoft codeanalysis symbolkey nondeclarationsymbolkey  enumeratesymbols microsoft codeanalysis compilation compilation  microsoft codeanalysis isymbol containingsymbol  string name  system threading cancellationtoken cancellationtoken  line             c   microsoft codeanalysis workspaces dll microsoft codeanalysis symbolkey nondeclarationsymbolkey  nondeclarationsymbolkey microsoft codeanalysis ilocalsymbol symbol  microsoft codeanalysis symbolkey visitor visitor  line               c   microsoft codeanalysis workspaces dll microsoft codeanalysis symbolkey visitor visitlocal microsoft codeanalysis ilocalsymbol localsymbol  line         c   microsoft codeanalysis csharp dll microsoft codeanalysis csharp symbols localsymbol accept  microsoft codeanalysis symbolvisitor  visitor   unknown  microsoft codeanalysis workspaces dll microsoft codeanalysis symbolkey getorcreate microsoft codeanalysis isymbol symbol  microsoft codeanalysis symbolkey visitor visitor  line             c     microsoft codeanalysis workspaces dll microsoft codeanalysis findsymbols symbolfinder findsourcedefinitionworkerasync microsoft codeanalysis isymbol symbol  microsoft codeanalysis solution solution  system threading cancellationtoken cancellationtoken  line                  c   microsoft codeanalysis workspaces dll microsoft codeanalysis findsymbols symbolfinder findsourcedefinitionasync microsoft codeanalysis isymbol symbol  microsoft codeanalysis solution solution  system threading cancellationtoken cancellationtoken  line                  c   microsoft codeanalysis editorfeatures dll microsoft codeanalysis editor implementation renametracking renametrackingtaggerprovider trackingsession determineifrenamablesymbolasync microsoft codeanalysis isymbol symbol  microsoft codeanalysis document document  microsoft codeanalysis syntaxtoken token           unknown  mscorlib dll system runtime compilerservices asynctaskmethodbuilder  start d     ref microsoft codeanalysis editor implementation renametracking renametrackingtaggerprovider trackingsession  d    statemachine   unknown  microsoft codeanalysis editorfeatures dll microsoft codeanalysis editor implementation renametracking renametrackingtaggerprovider trackingsession determineifrenamablesymbolasync microsoft codeanalysis isymbol symbol  microsoft codeanalysis document document  microsoft codeanalysis syntaxtoken token           unknown  microsoft codeanalysis editorfeatures dll microsoft codeanalysis editor implementation renametracking renametrackingtaggerprovider trackingsession determineifrenamableidentifierasync microsoft visualstudio text snapshotspan snapshotspan  bool initialcheck                unknown  mscorlib dll system runtime compilerservices asynctaskmethodbuilder  start d     ref microsoft codeanalysis editor implementation renametracking renametrackingtaggerprovider trackingsession  d    statemachine   unknown  microsoft codeanalysis editorfeatures dll microsoft codeanalysis editor implementation renametracking renametrackingtaggerprovider trackingsession determineifrenamableidentifierasync microsoft visualstudio text snapshotspan snapshotspan  bool initialcheck                unknown  microsoft codeanalysis editorfeatures dll microsoft codeanalysis editor implementation renametracking renametrackingtaggerprovider trackingsession checknewidentifier anonymousmethod    system threading tasks task  t              unknown  mscorlib dll system runtime compilerservices asynctaskmethodbuilder  start c       b    d statemachine   unknown  microsoft codeanalysis editorfeatures dll microsoft codeanalysis editor implementation renametracking renametrackingtaggerprovider trackingsession checknewidentifier anonymousmethod    system threading tasks task  t              unknown  microsoft codeanalysis workspaces dll roslyn utilities taskextensions safecontinuewithfromasync anonymousmethod    system threading tasks task antecedent  line        c   mscorlib dll system threading tasks continuationresulttaskfromtask  innerinvoke                  unknown                 mscorlib dll system threading tasks task execute           unknown                 mscorlib dll system threading tasks task executioncontextcallback object obj  unknown                 mscorlib dll system threading executioncontext runinternal system threading executioncontext executioncontext  system threading contextcallback callback  object state  bool preservesyncctx            unknown                 mscorlib dll system threading executioncontext run system threading executioncontext executioncontext  system threading contextcallback callback  object state  bool preservesyncctx  unknown                 mscorlib dll system threading tasks task executewiththreadlocal ref system threading tasks task currenttaskslot                unknown                 mscorlib dll system threading tasks task executeentry bool bpreventdoubleexecution  unknown                 mscorlib dll system threading tasks task system threading ithreadpoolworkitem executeworkitem                  unknown                 mscorlib dll system threading threadpoolworkqueue dispatch               unknown                 mscorlib dll system threading  threadpoolwaitcallback performwaitcallback   unknown           the repro itself is to select  underlyingtype   squiggled in red below  and type  x    this is using   update             ,13512637,26811119117.0,IssuesEvent,2023-02-01 22:29:31,dotnet/roslyn,https://api.github.com/repos/dotnet/roslyn,closed,System.ArgumentException: Not a C# symbol.,Bug help wanted Area-IDE Tenet-Reliability Developer Community,"**VS2019 16.2.0 Preview 3.0**352 353I have this simple method;354 355```356public static T NullObjectRetry&lt;T&gt;(Func&lt;T&gt; funcToRun)357{358    var returnVal = funcToRun();359 360for (var i = 0; i &lt; 10; i++)361    {362        if (returnVal == null)363        {364            Console.WriteLine(&quot;Retrying &quot; + (i + 1) + &quot; - &quot; + (i + 1) * 1000 + &quot; seconds&quot;);365            Thread.Sleep((i + 1) * 1000);366        }367        else368        {369            break;370        }371 372returnVal = funcToRun();373    }374 375return returnVal;376}377```378 379Every time I try to use this method writing something like the below;380 381```382bool isValueTrue = TestUtils.NullObjectRetry(() =&gt;383{384    if (fakeClass.GetBool() == false) return null;385    return true;386});387```388 389The second I begin to right a &quot;return&quot; statement within the function my VS just freezes and reboots; Looking at the event viewer there is an error saying;390 391```392Application: devenv.exe393Framework Version: v4.0.30319394Description: The application requested process termination through System.Environment.FailFast(string message).395Message: System.ArgumentException: Not a C# symbol.396Parameter name: typeArguments397```398 399and an application error saying;400 401```402Faulting application name: devenv.exe, version: 16.2.29021.104, time stamp: 0x5d0d2e76403Faulting module name: unknown, version: 0.0.0.0, time stamp: 0x00000000404Exception code: 0x80131623405Fault offset: 0x286a3212406Faulting process id: 0x5a0c407Faulting application start time: 0x01d53c242a0d7616408Faulting application path: C:\Program Files (x86)\Microsoft Visual Studio\2019\Preview\Common7\IDE\devenv.exe409Faulting module path: unknown410Report Id: da99e1ae-fb52-4517-bff9-45eeab6c14e0411Faulting package full name: 412Faulting package-relative application ID: 413```414 415I've attached to full stack trace.416 417_This issue has been moved from https://developercommunity.visualstudio.com/content/problem/648587/systemargumentexception-not-a-c-symbol.html418VSTS ticketId: 948096_419_These are the original issue comments:_420 421Visual Studio Feedback System on 7/17/2019, 01:46 AM (34 hours ago): <markdown><p>We have directed your feedback to the appropriate engineering team for further evaluation. The team will review the feedback and notify you about the next steps.</p>422</markdown>423_These are the original issue solutions:_424(no solutions)",True,"System.ArgumentException: Not a C# symbol. - **VS2019 16.2.0 Preview 3.0**425 426I have this simple method;427 428```429public static T NullObjectRetry&lt;T&gt;(Func&lt;T&gt; funcToRun)430{431    var returnVal = funcToRun();432 433for (var i = 0; i &lt; 10; i++)434    {435        if (returnVal == null)436        {437            Console.WriteLine(&quot;Retrying &quot; + (i + 1) + &quot; - &quot; + (i + 1) * 1000 + &quot; seconds&quot;);438            Thread.Sleep((i + 1) * 1000);439        }440        else441        {442            break;443        }444 445returnVal = funcToRun();446    }447 448return returnVal;449}450```451 452Every time I try to use this method writing something like the below;453 454```455bool isValueTrue = TestUtils.NullObjectRetry(() =&gt;456{457    if (fakeClass.GetBool() == false) return null;458    return true;459});460```461 462The second I begin to right a &quot;return&quot; statement within the function my VS just freezes and reboots; Looking at the event viewer there is an error saying;463 464```465Application: devenv.exe466Framework Version: v4.0.30319467Description: The application requested process termination through System.Environment.FailFast(string message).468Message: System.ArgumentException: Not a C# symbol.469Parameter name: typeArguments470```471 472and an application error saying;473 474```475Faulting application name: devenv.exe, version: 16.2.29021.104, time stamp: 0x5d0d2e76476Faulting module name: unknown, version: 0.0.0.0, time stamp: 0x00000000477Exception code: 0x80131623478Fault offset: 0x286a3212479Faulting process id: 0x5a0c480Faulting application start time: 0x01d53c242a0d7616481Faulting application path: C:\Program Files (x86)\Microsoft Visual Studio\2019\Preview\Common7\IDE\devenv.exe482Faulting module path: unknown483Report Id: da99e1ae-fb52-4517-bff9-45eeab6c14e0484Faulting package full name: 485Faulting package-relative application ID: 486```487 488I've attached to full stack trace.489 490_This issue has been moved from https://developercommunity.visualstudio.com/content/problem/648587/systemargumentexception-not-a-c-symbol.html491VSTS ticketId: 948096_492_These are the original issue comments:_493 494Visual Studio Feedback System on 7/17/2019, 01:46 AM (34 hours ago): <markdown><p>We have directed your feedback to the appropriate engineering team for further evaluation. The team will review the feedback and notify you about the next steps.</p>495</markdown>496_These are the original issue solutions:_497(no solutions)",1,system argumentexception  not a c  symbol              preview        i have this simple method       public static t nullobjectretry lt t gt  func lt t gt  functorun        var returnval   functorun     for  var i      i  lt     i                  if  returnval    null                        console writeline  quot retrying  quot     i         quot     quot     i             quot  seconds quot                thread sleep  i                              else                       break             returnval   functorun           return returnval         every time i try to use this method writing something like the below       bool isvaluetrue   testutils nullobjectretry      gt        if  fakeclass getbool      false  return null      return true           the second i begin to right a  quot return quot  statement within the function my vs just freezes and reboots  looking at the event viewer there is an error saying       application  devenv exe framework version        description  the application requested process termination through system environment failfast string message   message  system argumentexception  not a c  symbol  parameter name  typearguments      and an application error saying       faulting application name  devenv exe  version           time stamp    faulting module name  unknown  version           time stamp    exception code    fault offset    faulting process id    faulting application start time    faulting application path  c  program files     microsoft visual studio   preview   ide devenv exe faulting module path  unknown report id            faulting package full name   faulting package relative application id        i ve attached to full stack trace    this issue has been moved from   vsts ticketid      these are the original issue comments    visual studio feedback system on            am    hours ago     we have directed your feedback to the appropriate engineering team for further evaluation  the team will review the feedback and notify you about the next steps      these are the original issue solutions    no solutions ,149817412,23228628463.0,IssuesEvent,2022-08-03 04:44:38,qgis/QGIS-Documentation,https://api.github.com/repos/qgis/QGIS-Documentation,closed,"Add more advanced actions to processing dialog, including copy as qgis_process command, copy/paste as json (Request in QGIS)",Processing 3.24,"### Request for documentation499From pull request QGIS/qgis#46514500Author: @nyalldawson501QGIS version: 3.24502 503**Add more advanced actions to processing dialog, including copy as qgis_process command, copy/paste as json**504 505### PR Description:506Together these actions:507 508- Allow for easy generation of qgis_process commands via the QGIS gui, including any tricky parameter values like gpkg outputs with specific layer (refs https://github.com/qgis/QGIS/issues/38272)509- Provide a way for users to copy the settings defined in the dialog in a text format, so they can store these easily and then510restore later by pasting the value 511- Provides an easy way for users to copy the settings into the json format consumed by qgis_process (following #46497), so that it is easy for users to see the expected format even for complex parameters (like tin interpolation parameters)512 513Refs paleolimbot/qgisprocess#56514Refs paleolimbot/qgisprocess#44515 516Sponsored by the Research Institute for Nature and Forest, Flemish Govt517 518### Commits tagged with [need-docs] or [FEATURE]519""[feature] Add action in advanced menu for processing algorithm to copy\nequivalent qgis_process command\n\nAllows for easy generation of qgis_process commands via the QGIS gui"" ""[feature] Add action to processing algorithm advanced menu to copy the\ncurrent settings as JSON and paste json settings from clipboard\n\nThe utility of this is two fold:\n\n1. It provides a way for users to copy the settings defined in the\ndialog in a text format, so they can store these easily and then\nrestore later by pasting the value\n\n2. It provides an easy way for users to copy the settings into\nthe json format consumed by qgis_process (following\nhttps://github.com/qgis/QGIS/pull/46497), so that it is easy\nfor users to see the expected format even for complex parameters\n(like tin interpolation parameters)""",1.0,"Add more advanced actions to processing dialog, including copy as qgis_process command, copy/paste as json (Request in QGIS) - ### Request for documentation520From pull request QGIS/qgis#46514521Author: @nyalldawson522QGIS version: 3.24523 524**Add more advanced actions to processing dialog, including copy as qgis_process command, copy/paste as json**525 526### PR Description:527Together these actions:528 529- Allow for easy generation of qgis_process commands via the QGIS gui, including any tricky parameter values like gpkg outputs with specific layer (refs https://github.com/qgis/QGIS/issues/38272)530- Provide a way for users to copy the settings defined in the dialog in a text format, so they can store these easily and then531restore later by pasting the value 532- Provides an easy way for users to copy the settings into the json format consumed by qgis_process (following #46497), so that it is easy for users to see the expected format even for complex parameters (like tin interpolation parameters)533 534Refs paleolimbot/qgisprocess#56535Refs paleolimbot/qgisprocess#44536 537Sponsored by the Research Institute for Nature and Forest, Flemish Govt538 539### Commits tagged with [need-docs] or [FEATURE]540""[feature] Add action in advanced menu for processing algorithm to copy\nequivalent qgis_process command\n\nAllows for easy generation of qgis_process commands via the QGIS gui"" ""[feature] Add action to processing algorithm advanced menu to copy the\ncurrent settings as JSON and paste json settings from clipboard\n\nThe utility of this is two fold:\n\n1. It provides a way for users to copy the settings defined in the\ndialog in a text format, so they can store these easily and then\nrestore later by pasting the value\n\n2. It provides an easy way for users to copy the settings into\nthe json format consumed by qgis_process (following\nhttps://github.com/qgis/QGIS/pull/46497), so that it is easy\nfor users to see the expected format even for complex parameters\n(like tin interpolation parameters)""",0,add more advanced actions to processing dialog  including copy as qgis process command  copy paste as json  request in qgis        request for documentation from pull request qgis qgis   author   nyalldawson qgis version         add more advanced actions to processing dialog  including copy as qgis process command  copy paste as json        pr description  together these actions       allow for easy generation of qgis process commands via the qgis gui  including any tricky parameter values like gpkg outputs with specific layer  refs      provide a way for users to copy the settings defined in the dialog in a text format  so they can store these easily and then  restore later by pasting the value     provides an easy way for users to copy the settings into the json format consumed by qgis process  following      so that it is easy for users to see the expected format even for complex parameters  like tin interpolation parameters     refs paleolimbot qgisprocess    refs paleolimbot qgisprocess      sponsored by the research institute for nature and forest  flemish govt      commits tagged with   or      add action in advanced menu for processing algorithm to copy nequivalent qgis process command n nallows for easy generation of qgis process commands via the qgis gui     add action to processing algorithm advanced menu to copy the ncurrent settings as json and paste json settings from clipboard n nthe utility of this is two fold  n    it provides a way for users to copy the settings defined in the ndialog in a text format  so they can store these easily and then nrestore later by pasting the value n    it provides an easy way for users to copy the settings into nthe json format consumed by qgis process  following n  so that it is easy nfor users to see the expected format even for complex parameters n like tin interpolation parameters  ,054181556,31018920406.0,IssuesEvent,2023-08-10 02:29:59,openzfs/zfs,https://api.github.com/repos/openzfs/zfs,closed,"Data corruption since generic_file_splice_read -> filemap_splice_read change (6.5 compat, but occurs on 6.4 too)",Type: Defect,"### System information542Type | Version/Name543 --- | ---544Distribution Name	| Arch545Distribution Version	| Rolling release546Kernel Version	| 6.4.8, 6.5rc1/2/3/4547Architecture	| x86-64548OpenZFS Version	| [commit 36261c8](https://github.com/openzfs/zfs/commit/36261c8238df462b214854ccea1df4f060cf0995)549 550### Describe the problem you're observing551After the recent changes to get OpenZFS compiling/running on 6.5, there appears to be a possible lingering data corruption bug. In the repeatable example below, it reliably inserts a long run of NULL bytes into a file, causing a build to fail (conveniently, the build of ZFS).552 553My expectation is that the bug probably exists for any kernel where `filemap_splice_read` exists, which recently has replaced `generic_file_splice_read` in other Linux filesystem code.554 555### Describe how to reproduce the problem556**Again - despite demonstrating the problem with the OpenZFS build, the problem only manifests itself when running on the ZFS branch at the commit listed above. It just so happens that I'm able to use our build to reproduce the bug.**557 5581. You need to be running ZFS patched up to the commit listed above. I have reproduced this on Kernel 6.4.8 and all 6.5 RC's up to rc45592. `git clone https://github.com/openzfs/zfs.git`5603. `cd ./zfs`5614. `./autogen.sh`5625. `mkdir -p ../zfs-test`5636. `cd ../zfs-test`5647. `../zfs/configure --with-linux=/usr/src/linux` (or wherever your headers/source tree is)565 566Eventually, the `configure` will fail with the following message:567```568configure: error: 569                *** This kernel does not include the required loadable module570                *** support!571                ***572                *** To build OpenZFS as a loadable Linux kernel module573                *** enable loadable module support by setting574                *** `CONFIG_MODULES=y` in the kernel configuration and run575                *** `make modules_prepare` in the Linux source tree.576                ***577                *** If you don't intend to enable loadable kernel module578                *** support, please compile OpenZFS as a Linux kernel built-in.579                ***580                *** Prepare the Linux source tree by running `make prepare`,581                *** use the OpenZFS `--enable-linux-builtin` configure option,582                *** copy the OpenZFS sources into the Linux source tree using583                *** `./copy-builtin <linux source directory>`,584                *** set `CONFIG_ZFS=y` in the kernel configuration and compile585                *** kernel as usual.586```587 588I enter the directory of the failing test:589```590cd build/config_modules591```592 593Looking at the `config_modules.c` file, which is resulting in the failure:594```c595/* confdefs.h */596#define PACKAGE_NAME ""zfs""597#define PACKAGE_TARNAME ""zfs""598#define PACKAGE_VERSION ""2.2.99""599#define PACKAGE_STRING ""zfs 2.2.99""600#define PACKAGE_BUGREPORT """"601#define PACKAGE_URL """"602#define ZFS_META_NAME ""zfs""603#define ZFS_META_VERSION ""2.2.99""604#define SPL_META_VERSION ZFS_META_VERSION605#define ZFS_META_RELEASE ""1""606#define SPL_META_RELEASE ZFS_META_RELEASE607#define ZFS_META_LICENSE ""CDDL""608#define ZFS_META_ALIAS ""zfs-2.2.99-1""609#define SPL_META_ALIAS ZFS_META_ALIAS610#define ZFS_META_AUTHOR ""OpenZFS""611#define ZFS_META_KVER_MIN ""3.10""612#define ZFS_META_KVER_MAX ""6.4""613#define PACKAGE ""zfs""614#define VERSION ""2.2.99""615^@^@^@^@^@^@^@^@^@^@^@^@^@^@^@^@^@^@^@^@^@^@^@^@^@^@^@^@^@^@^@^@^@^@^@^@^@^@^@^@^@^@^@^@^@^@^@^@^@^@^@^@^@^@^@^@^@^@^@^@^@^@^@^@^@^@^@^@^@^@^@^@^@^@^@^@^@^@^@^@^@616^@^@^@^@^@^@^@^@^@^@^@^@^@^@^@^@^@^@^@^@^@^@^@^@^@^@^@^@^@^@^@^@^@^@^@^@^@^@^@^@^@^@^@^@^@^@^@^@^@^@^@^@^@^@^@^@^@^@^@^@^@^@^@^@^@^@^@^@^@^@^@^@^@^@^@^@^@^@^@^@^@617^@^@^@^@^@^@^@^@^@^@^@^@^@^@^@^@^@^@^@^@^@^@^@^@^@^@^@^@^@^@^@^@^@^@^@^@^@^@^@^@^@^@^@^@^@^@^@^@^@^@^@^@^@^@^@^@^@^@^@^@^@^@^@^@^@^@^@^@^@^@^@^@^@^@^@^@^@^@^@^@^@618^@^@^@^@^@^@^@^@^@^@^@^@^@^@^@^@^@^@^@^@^@^@^@^@^@^@^@^@^@^@^@^@^@^@^@^@^@^@^@^@^@^@^@^@^@^@^@^@^@^@^@^@^@^@^@^@^@^@^@^@^@^@^@^@^@^@^@^@^@^@^@^@^@^@^@^@^@^@^@^@^@619^@^@^@^@^@^@^@^@^@^@^@^@^@^@^@^@^@^@^@^@^@^@^@^@^@^@^@^@^@^@^@^@^@^@^@^@^@^@^@^@^@^@^@^@^@^@^@^@^@^@^@^@^@^@^@^@^@^@^@^@^@^@^@^@^@^@^@^@^@^@^@^@^@^@^@^@^@^@^@^@^@620^@^@^@^@^@^@^@^@^@^@^@^@^@^@^@^@^@^@^@^@^@^@^@^@^@^@^@^@^@^@^@^@^@^@^@^@^@^@^@^@^@^@^@^@^@^@^@^@^@^@^@^@^@^@^@^@^@^@^@^@^@^@^@^@^@^@^@^@^@^@^@^@^@^@^@^@^@^@^@^@^@621^@^@^@^@^@^@^@^@^@^@^@^@^@^@^@^@^@^@^@^@^@^@^@^@^@^@^@^@^@^@^@^@^@^@^@^@^@^@^@^@^@^@^@^@^@^@^@^@^@^@^@^@^@^@^@^@^@^@^@^@^@^@^@^@^@^@^@^@^@^@^@^@^@^@^@^@^@^@^@^@^@622^@^@^@^@^@^@^@^@^@^@^@^@^@^@^@^@^@^@^@^@^@^@^@^@^@^@^@^@^@^@^@^@^@^@^@^@^@^@^@^@^@^@^@^@^@^@^@^@^@^@^@^@^@^@^@^@^@^@^@^@^@^@^@^@^@^@^@^@^@^@^@^@^@^@^@^@^@^@^@^@^@623^@^@^@^@^@^@^@^@^@^@^@^@^@^@^@^@^@^@^@^@^@^@^@^@^@^@^@^@^@^@^@^@^@^@^@^@^@^@^@^@^@^@^@^@^@^@^@^@^@^@^@^@^@^@^@^@^@^@^@^@^@^@^@^@^@^@^@^@^@^@^@^@^@^@^@^@^@^@^@^@^@624^@^@^@^@^@^@^@^@^@^@^@^@^@^@^@^@^@^@^@^@^@^@^@^@^@^@^@^@^@^@^@^@^@^@^@^@^@^@^@^@^@^@^@^@^@^@^@^@^@^@^@^@^@^@^@^@^@^@^@^@^@^@^@^@^@^@^@^@^@^@^@^@^@^@^@^@^@^@^@^@^@625^@^@^@^@^@^@^@^@^@^@^@^@^@^@^@^@^@^@^@^@^@^@^@^@^@^@^@^@^@^@^@^@^@^@^@^@^@^@^@^@^@^@^@^@^@^@^@^@^@^@^@^@^@^@^@^@^@^@^@^@^@^@^@^@^@^@^@^@^@^@^@^@^@^@^@^@^@^@^@^@^@626^@^@^@^@^@^@^@^@^@^@^@^@^@^@^@^@^@^@^@^@^@^@^@^@^@^@^@^@^@^@^@^@^@^@^@^@^@^@^@^@^@^@^@^@^@^@^@^@^@^@^@^@^@^@^@^@^@^@^@^@^@^@^@^@^@^@^@^@^@^@^@^@^@^@^@^@^@^@^@^@^@627^@^@^@^@^@^@^@^@^@^@^@^@^@^@^@^@^@^@^@^@^@^@^@^@^@^@^@^@^@^@^@^@^@^@^@^@^@^@^@^@^@^@^@^@^@^@^@^@^@^@^@^@^@^@^@^@^@^@^@^@^@^@^@^@^@^@^@^@^@^@^@^@^@^@^@^@^@^@^@^@^@628^@^@^@^@^@^@^@^@^@^@^@^@^@^@^@^@^@^@^@^@^@^@^@^@^@^@^@^@^@^@^@^@^@^@^@^@^@^@^@^@^@^@^@^@^@^@^@^@^@^@^@^@^@^@^@^@^@^@^@^@^@^@^@^@^@^@^@^@^@^@^@^@^@^@^@^@^@^@^@^@^@629^@^@^@^@^@^@^@^@^@^@^@^@^@^@^@^@^@^@^@^@^@^@^@^@^@^@^@^@^@^@^@^@^@^@^@^@^@^@^@^@^@^@^@^@^@^@^@^@^@^@^@^@^@^@^@^@^@^@^@^@^@^@^@^@^@^@^@^@^@^@^@^@^@^@^@^@^@^@^@^@^@630^@^@^@^@^@^@^@^@^@^@^@^@^@^@^@^@^@^@^@^@^@^@^@^@^@^@^@^@^@^@^@^@^@^@^@^@^@^@^@^@^@^@^@^@^@^@^@^@^@^@^@^@^@^@^@^@^@^@^@^@^@^@^@^@^@^@^@^@^@^@^@^@^@^@^@^@^@^@^@^@^@631^@^@^@^@^@^@^@^@^@^@^@^@^@^@^@^@^@^@^@^@^@^@^@^@^@^@^@^@^@^@^@^@^@^@^@^@^@^@^@^@^@^@^@^@^@^@^@^@^@^@^@^@^@^@^@^@^@^@^@^@^@^@^@^@^@^@^@^@^@^@^@^@^@^@^@^@^@^@^@^@^@632^@^@^@^@^@^@^@^@^@^@^@^@^@^@^@^@^@^@^@^@^@^@^@^@^@^@633#include <linux/module.h>634 635                #if !defined(CONFIG_MODULES)636                #error CONFIG_MODULES not defined637                #endif638 639 640int641main (void)642{643 644        ;645        return 0;646}647```648 649Curiously, this bug does not manifest frequently and the system largely appears to run stable in many other use cases.650 651The section of `configure` that writes that file looks like below. Including this snippet here as it might help illuminate what conditions need to be true to trigger the bug:652```bash653cat confdefs.h - <<_ACEOF >build/config_modules/config_modules.c654 655#include <linux/module.h>656 657                #if !defined(CONFIG_MODULES)658                #error CONFIG_MODULES not defined659                #endif660 661 662int663main (void)664{665 666        ;667        return 0;668}669 670MODULE_DESCRIPTION(""conftest"");671MODULE_AUTHOR(ZFS_META_AUTHOR);672MODULE_VERSION(ZFS_META_VERSION ""-"" ZFS_META_RELEASE);673MODULE_LICENSE(""Dual BSD/GPL"");674 675_ACEOF676```677 678### Include any warning/errors/backtraces from the system logs679There are no errors reported to the console or in kernel messages",1.0,"Data corruption since generic_file_splice_read -> filemap_splice_read change (6.5 compat, but occurs on 6.4 too) - ### System information680Type | Version/Name681 --- | ---682Distribution Name	| Arch683Distribution Version	| Rolling release684Kernel Version	| 6.4.8, 6.5rc1/2/3/4685Architecture	| x86-64686OpenZFS Version	| [commit 36261c8](https://github.com/openzfs/zfs/commit/36261c8238df462b214854ccea1df4f060cf0995)687 688### Describe the problem you're observing689After the recent changes to get OpenZFS compiling/running on 6.5, there appears to be a possible lingering data corruption bug. In the repeatable example below, it reliably inserts a long run of NULL bytes into a file, causing a build to fail (conveniently, the build of ZFS).690 691My expectation is that the bug probably exists for any kernel where `filemap_splice_read` exists, which recently has replaced `generic_file_splice_read` in other Linux filesystem code.692 693### Describe how to reproduce the problem694**Again - despite demonstrating the problem with the OpenZFS build, the problem only manifests itself when running on the ZFS branch at the commit listed above. It just so happens that I'm able to use our build to reproduce the bug.**695 6961. You need to be running ZFS patched up to the commit listed above. I have reproduced this on Kernel 6.4.8 and all 6.5 RC's up to rc46972. `git clone https://github.com/openzfs/zfs.git`6983. `cd ./zfs`6994. `./autogen.sh`7005. `mkdir -p ../zfs-test`7016. `cd ../zfs-test`7027. `../zfs/configure --with-linux=/usr/src/linux` (or wherever your headers/source tree is)703 704Eventually, the `configure` will fail with the following message:705```706configure: error: 707                *** This kernel does not include the required loadable module708                *** support!709                ***710                *** To build OpenZFS as a loadable Linux kernel module711                *** enable loadable module support by setting712                *** `CONFIG_MODULES=y` in the kernel configuration and run713                *** `make modules_prepare` in the Linux source tree.714                ***715                *** If you don't intend to enable loadable kernel module716                *** support, please compile OpenZFS as a Linux kernel built-in.717                ***718                *** Prepare the Linux source tree by running `make prepare`,719                *** use the OpenZFS `--enable-linux-builtin` configure option,720                *** copy the OpenZFS sources into the Linux source tree using721                *** `./copy-builtin <linux source directory>`,722                *** set `CONFIG_ZFS=y` in the kernel configuration and compile723                *** kernel as usual.724```725 726I enter the directory of the failing test:727```728cd build/config_modules729```730 731Looking at the `config_modules.c` file, which is resulting in the failure:732```c733/* confdefs.h */734#define PACKAGE_NAME ""zfs""735#define PACKAGE_TARNAME ""zfs""736#define PACKAGE_VERSION ""2.2.99""737#define PACKAGE_STRING ""zfs 2.2.99""738#define PACKAGE_BUGREPORT """"739#define PACKAGE_URL """"740#define ZFS_META_NAME ""zfs""741#define ZFS_META_VERSION ""2.2.99""742#define SPL_META_VERSION ZFS_META_VERSION743#define ZFS_META_RELEASE ""1""744#define SPL_META_RELEASE ZFS_META_RELEASE745#define ZFS_META_LICENSE ""CDDL""746#define ZFS_META_ALIAS ""zfs-2.2.99-1""747#define SPL_META_ALIAS ZFS_META_ALIAS748#define ZFS_META_AUTHOR ""OpenZFS""749#define ZFS_META_KVER_MIN ""3.10""750#define ZFS_META_KVER_MAX ""6.4""751#define PACKAGE ""zfs""752#define VERSION ""2.2.99""753^@^@^@^@^@^@^@^@^@^@^@^@^@^@^@^@^@^@^@^@^@^@^@^@^@^@^@^@^@^@^@^@^@^@^@^@^@^@^@^@^@^@^@^@^@^@^@^@^@^@^@^@^@^@^@^@^@^@^@^@^@^@^@^@^@^@^@^@^@^@^@^@^@^@^@^@^@^@^@^@^@754^@^@^@^@^@^@^@^@^@^@^@^@^@^@^@^@^@^@^@^@^@^@^@^@^@^@^@^@^@^@^@^@^@^@^@^@^@^@^@^@^@^@^@^@^@^@^@^@^@^@^@^@^@^@^@^@^@^@^@^@^@^@^@^@^@^@^@^@^@^@^@^@^@^@^@^@^@^@^@^@^@755^@^@^@^@^@^@^@^@^@^@^@^@^@^@^@^@^@^@^@^@^@^@^@^@^@^@^@^@^@^@^@^@^@^@^@^@^@^@^@^@^@^@^@^@^@^@^@^@^@^@^@^@^@^@^@^@^@^@^@^@^@^@^@^@^@^@^@^@^@^@^@^@^@^@^@^@^@^@^@^@^@756^@^@^@^@^@^@^@^@^@^@^@^@^@^@^@^@^@^@^@^@^@^@^@^@^@^@^@^@^@^@^@^@^@^@^@^@^@^@^@^@^@^@^@^@^@^@^@^@^@^@^@^@^@^@^@^@^@^@^@^@^@^@^@^@^@^@^@^@^@^@^@^@^@^@^@^@^@^@^@^@^@757^@^@^@^@^@^@^@^@^@^@^@^@^@^@^@^@^@^@^@^@^@^@^@^@^@^@^@^@^@^@^@^@^@^@^@^@^@^@^@^@^@^@^@^@^@^@^@^@^@^@^@^@^@^@^@^@^@^@^@^@^@^@^@^@^@^@^@^@^@^@^@^@^@^@^@^@^@^@^@^@^@758^@^@^@^@^@^@^@^@^@^@^@^@^@^@^@^@^@^@^@^@^@^@^@^@^@^@^@^@^@^@^@^@^@^@^@^@^@^@^@^@^@^@^@^@^@^@^@^@^@^@^@^@^@^@^@^@^@^@^@^@^@^@^@^@^@^@^@^@^@^@^@^@^@^@^@^@^@^@^@^@^@759^@^@^@^@^@^@^@^@^@^@^@^@^@^@^@^@^@^@^@^@^@^@^@^@^@^@^@^@^@^@^@^@^@^@^@^@^@^@^@^@^@^@^@^@^@^@^@^@^@^@^@^@^@^@^@^@^@^@^@^@^@^@^@^@^@^@^@^@^@^@^@^@^@^@^@^@^@^@^@^@^@760^@^@^@^@^@^@^@^@^@^@^@^@^@^@^@^@^@^@^@^@^@^@^@^@^@^@^@^@^@^@^@^@^@^@^@^@^@^@^@^@^@^@^@^@^@^@^@^@^@^@^@^@^@^@^@^@^@^@^@^@^@^@^@^@^@^@^@^@^@^@^@^@^@^@^@^@^@^@^@^@^@761^@^@^@^@^@^@^@^@^@^@^@^@^@^@^@^@^@^@^@^@^@^@^@^@^@^@^@^@^@^@^@^@^@^@^@^@^@^@^@^@^@^@^@^@^@^@^@^@^@^@^@^@^@^@^@^@^@^@^@^@^@^@^@^@^@^@^@^@^@^@^@^@^@^@^@^@^@^@^@^@^@762^@^@^@^@^@^@^@^@^@^@^@^@^@^@^@^@^@^@^@^@^@^@^@^@^@^@^@^@^@^@^@^@^@^@^@^@^@^@^@^@^@^@^@^@^@^@^@^@^@^@^@^@^@^@^@^@^@^@^@^@^@^@^@^@^@^@^@^@^@^@^@^@^@^@^@^@^@^@^@^@^@763^@^@^@^@^@^@^@^@^@^@^@^@^@^@^@^@^@^@^@^@^@^@^@^@^@^@^@^@^@^@^@^@^@^@^@^@^@^@^@^@^@^@^@^@^@^@^@^@^@^@^@^@^@^@^@^@^@^@^@^@^@^@^@^@^@^@^@^@^@^@^@^@^@^@^@^@^@^@^@^@^@764^@^@^@^@^@^@^@^@^@^@^@^@^@^@^@^@^@^@^@^@^@^@^@^@^@^@^@^@^@^@^@^@^@^@^@^@^@^@^@^@^@^@^@^@^@^@^@^@^@^@^@^@^@^@^@^@^@^@^@^@^@^@^@^@^@^@^@^@^@^@^@^@^@^@^@^@^@^@^@^@^@765^@^@^@^@^@^@^@^@^@^@^@^@^@^@^@^@^@^@^@^@^@^@^@^@^@^@^@^@^@^@^@^@^@^@^@^@^@^@^@^@^@^@^@^@^@^@^@^@^@^@^@^@^@^@^@^@^@^@^@^@^@^@^@^@^@^@^@^@^@^@^@^@^@^@^@^@^@^@^@^@^@766^@^@^@^@^@^@^@^@^@^@^@^@^@^@^@^@^@^@^@^@^@^@^@^@^@^@^@^@^@^@^@^@^@^@^@^@^@^@^@^@^@^@^@^@^@^@^@^@^@^@^@^@^@^@^@^@^@^@^@^@^@^@^@^@^@^@^@^@^@^@^@^@^@^@^@^@^@^@^@^@^@767^@^@^@^@^@^@^@^@^@^@^@^@^@^@^@^@^@^@^@^@^@^@^@^@^@^@^@^@^@^@^@^@^@^@^@^@^@^@^@^@^@^@^@^@^@^@^@^@^@^@^@^@^@^@^@^@^@^@^@^@^@^@^@^@^@^@^@^@^@^@^@^@^@^@^@^@^@^@^@^@^@768^@^@^@^@^@^@^@^@^@^@^@^@^@^@^@^@^@^@^@^@^@^@^@^@^@^@^@^@^@^@^@^@^@^@^@^@^@^@^@^@^@^@^@^@^@^@^@^@^@^@^@^@^@^@^@^@^@^@^@^@^@^@^@^@^@^@^@^@^@^@^@^@^@^@^@^@^@^@^@^@^@769^@^@^@^@^@^@^@^@^@^@^@^@^@^@^@^@^@^@^@^@^@^@^@^@^@^@^@^@^@^@^@^@^@^@^@^@^@^@^@^@^@^@^@^@^@^@^@^@^@^@^@^@^@^@^@^@^@^@^@^@^@^@^@^@^@^@^@^@^@^@^@^@^@^@^@^@^@^@^@^@^@770^@^@^@^@^@^@^@^@^@^@^@^@^@^@^@^@^@^@^@^@^@^@^@^@^@^@771#include <linux/module.h>772 773                #if !defined(CONFIG_MODULES)774                #error CONFIG_MODULES not defined775                #endif776 777 778int779main (void)780{781 782        ;783        return 0;784}785```786 787Curiously, this bug does not manifest frequently and the system largely appears to run stable in many other use cases.788 789The section of `configure` that writes that file looks like below. Including this snippet here as it might help illuminate what conditions need to be true to trigger the bug:790```bash791cat confdefs.h - <<_ACEOF >build/config_modules/config_modules.c792 793#include <linux/module.h>794 795                #if !defined(CONFIG_MODULES)796                #error CONFIG_MODULES not defined797                #endif798 799 800int801main (void)802{803 804        ;805        return 0;806}807 808MODULE_DESCRIPTION(""conftest"");809MODULE_AUTHOR(ZFS_META_AUTHOR);810MODULE_VERSION(ZFS_META_VERSION ""-"" ZFS_META_RELEASE);811MODULE_LICENSE(""Dual BSD/GPL"");812 813_ACEOF814```815 816### Include any warning/errors/backtraces from the system logs817There are no errors reported to the console or in kernel messages",0,data corruption since generic file splice read    filemap splice read change      compat  but occurs on     too        system information  type   version name              distribution name	  arch  distribution version	  rolling release  kernel version	                    architecture	       openzfs version	             describe the problem you re observing  after the recent changes to get openzfs compiling running on      there appears to be a possible lingering data corruption bug  in the repeatable example below  it reliably inserts a long run of null bytes into a file  causing a build to fail  conveniently  the build of zfs      my expectation is that the bug probably exists for any kernel where  filemap splice read  exists  which recently has replaced  generic file splice read  in other linux filesystem code         describe how to reproduce the problem    again   despite demonstrating the problem with the openzfs build  the problem only manifests itself when running on the zfs branch at the commit listed above  it just so happens that i m able to use our build to reproduce the bug          you need to be running zfs patched up to the commit listed above  i have reproduced this on kernel       and all     rc s up to        git clone        cd   zfs         autogen sh       mkdir  p    zfs test       cd    zfs test          zfs configure   with linux  usr src linux   or wherever your headers source tree is     eventually  the  configure  will fail with the following message        configure  error                        this kernel does not include the required loadable module                      support                                            to build openzfs as a loadable linux kernel module                      enable loadable module support by setting                       config modules y  in the kernel configuration and run                       make modules prepare  in the linux source tree                                            if you don t intend to enable loadable kernel module                      support  please compile openzfs as a linux kernel built in                                            prepare the linux source tree by running  make prepare                        use the openzfs    enable linux builtin  configure option                       copy the openzfs sources into the linux source tree using                         copy builtin                          set  config zfs y  in the kernel configuration and compile                      kernel as usual          i enter the directory of the failing test        cd build config modules         looking at the  config modules c  file  which is resulting in the failure      c     confdefs h      define package name  zfs    define package tarname  zfs    define package version           define package string  zfs          define package bugreport      define package url      define zfs meta name  zfs    define zfs meta version           define spl meta version zfs meta version   define zfs meta release       define spl meta release zfs meta release   define zfs meta license  cddl    define zfs meta alias  zfs            define spl meta alias zfs meta alias   define zfs meta author  openzfs    define zfs meta kver min         define zfs meta kver max         define package  zfs    define version                                                                                                                                                                                                                                                                                                                                                                                                                                                                                                                                                                                                                                                                                                                                                                                                                                                                                                                                                                                                                                                                                                                                                                                                                                                                                                                                                                                                                                                                                                                                                                                                                                                                                                                                                                                                                                                                                                                                                                                                                                                                                                                                                                                                                                                                                                                                                                                                                                                                                                                                                                                                                                                                                                                                                                                                                                                                                                                                                                     include                       if  defined config modules                    error config modules not defined                   endif      int  main  void                           return               curiously  this bug does not manifest frequently and the system largely appears to run stable in many other use cases     the section of  configure  that writes that file looks like below  including this snippet here as it might help illuminate what conditions need to be true to trigger the bug      bash  cat confdefs h    build config modules config modules c     include                       if  defined config modules                    error config modules not defined                   endif      int  main  void                           return          module description  conftest     module author zfs meta author    module version zfs meta version     zfs meta release    module license  dual bsd gpl        aceof             include any warning errors backtraces from the system logs  there are no errors reported to the console or in kernel messages,081838042,8639913268.0,IssuesEvent,2018-11-23 22:39:15,bridgedotnet/Bridge,https://api.github.com/repos/bridgedotnet/Bridge,closed,Comparer<string>.Default not using System.String.compare,defect in-progress,"Comparer<string>.Default.Compare(str1, str2) gives a different result the str1CompareTo(str2).819 820The first case calls Bridge.compare, and seems to perform char sorting.821The second case calls System.String.compare and seems to correctly sort text.822 823https://deck.net/42fe359ec3524e6024107106ec9c9386824 825I would expect that Comparer<string>.Default would call System.String.compare as System.String implements IComparer<System.String>.826",1.0,"Comparer<string>.Default not using System.String.compare - Comparer<string>.Default.Compare(str1, str2) gives a different result the str1CompareTo(str2).827 828The first case calls Bridge.compare, and seems to perform char sorting.829The second case calls System.String.compare and seems to correctly sort text.830 831https://deck.net/42fe359ec3524e6024107106ec9c9386832 833I would expect that Comparer<string>.Default would call System.String.compare as System.String implements IComparer<System.String>.834",0,comparer  default not using system string compare   comparer  default compare       gives a different result the          the first case calls bridge compare  and seems to perform char sorting   the second case calls system string compare and seems to correctly sort text          i would expect that comparer  default would call system string compare as system string implements icomparer    ,0835128078,5048334738.0,IssuesEvent,2016-12-20 12:33:38,TASVideos/BizHawk,https://api.github.com/repos/TASVideos/BizHawk,closed,snes BSX support,Assigned-zeromus auto-migrated Core-BSNES Priority-Low Type-Enhancement,"```836i'm not sure BSX roms can be detected. if so, detect it.837we may need to put them in the gamedb.838otherwise, we need a special rom load option.839bsnes 0.87 requires specially selected load options.840```841 842Original issue reported on code.google.com by `zero...@zeromus.org` on 20 Apr 2014 at 11:15843",1.0,"snes BSX support - ```844i'm not sure BSX roms can be detected. if so, detect it.845we may need to put them in the gamedb.846otherwise, we need a special rom load option.847bsnes 0.87 requires specially selected load options.848```849 850Original issue reported on code.google.com by `zero...@zeromus.org` on 20 Apr 2014 at 11:15851",0,snes bsx support       i m not sure bsx roms can be detected  if so  detect it  we may need to put them in the gamedb  otherwise  we need a special rom load option  bsnes     requires specially selected load options       original issue reported on code google com by  zero    zeromus org  on   apr   at     ,0852547865,16048735449.0,IssuesEvent,2021-04-22 16:25:55,HabitRPG/habitica,https://api.github.com/repos/HabitRPG/habitica,closed,New Achievements and Badges: Checked in X Days in a Row,priority: medium section: Avatar/User Modal status: issue: on hold type: medium level coding,"These new achievements and badges are ready to be implemented! These should be received when a player checks in for the number of days indicated by each badge. The badge images and the names/mouseover text for the user achievement page can be found here: 853 854https://trello.com/c/uxR0r5R0/5-checked-in-x-days-in-a-row-badges",1.0,"New Achievements and Badges: Checked in X Days in a Row - These new achievements and badges are ready to be implemented! These should be received when a player checks in for the number of days indicated by each badge. The badge images and the names/mouseover text for the user achievement page can be found here: 855 856https://trello.com/c/uxR0r5R0/5-checked-in-x-days-in-a-row-badges",0,new achievements and badges  checked in x days in a row   these new achievements and badges are ready to be implemented  these should be received when a player checks in for the number of days indicated by each badge  the badge images and the names mouseover text for the user achievement page can be found here       ,0857490,7868920385.0,IssuesEvent,2018-06-24 06:47:53,dotnet/roslyn,https://api.github.com/repos/dotnet/roslyn,closed,OperationCanceledException during Formatting,Area-IDE Bug Tenet-Reliability,"A customer found this in their activity log after editing JS/TS in a session with responsiveness issues.858 859```860System.OperationCanceledException: The operation was canceled.861   at System.Threading.CancellationToken.ThrowOperationCanceledException()862   at System.Threading.Tasks.Task.Wait(Int32 millisecondsTimeout, CancellationToken cancellationToken)863   at Roslyn.Utilities.TaskExtensions.WaitAndGetResult_CanCallOnBackground[T](Task`1 task, CancellationToken cancellationToken)864   at Microsoft.CodeAnalysis.Editor.Implementation.Formatting.FormatCommandHandler.ExecuteReturnOrTypeCommand(EditorCommandArgs args, Action nextHandler, CancellationToken cancellationToken)865   at Microsoft.CodeAnalysis.Editor.Implementation.Formatting.FormatCommandHandler.ExecuteCommand(ReturnKeyCommandArgs args, Action nextHandler, CommandExecutionContext context)866   at Microsoft.VisualStudio.Commanding.CommandHandlerExtensions.ExecuteCommand[T](ICommandHandler commandHandler, T args, Action nextCommandHandler, CommandExecutionContext executionContext)867   at Microsoft.VisualStudio.UI.Text.Commanding.Implementation.EditorCommandHandlerService.&lt;&gt;c__DisplayClass14_1`1.&lt;Execute&gt;b__1()868   at Microsoft.VisualStudio.Text.Utilities.GuardedOperations.CallExtensionPoint(Object errorSource, Action call)869--- End of stack trace from previous location where exception was thrown ---870   at Microsoft.VisualStudio.Telemetry.WindowsErrorReporting.WatsonReport.GetClrWatsonExceptionInfo(Exception exceptionObject)871```872 873My guess is that JS/TS formatting was too slow and either the user or a timeout attempted to cancel the operation.  Perhaps OperationCanceledException is not supposed to bubble out of a command handler?",True,"OperationCanceledException during Formatting - A customer found this in their activity log after editing JS/TS in a session with responsiveness issues.874 875```876System.OperationCanceledException: The operation was canceled.877   at System.Threading.CancellationToken.ThrowOperationCanceledException()878   at System.Threading.Tasks.Task.Wait(Int32 millisecondsTimeout, CancellationToken cancellationToken)879   at Roslyn.Utilities.TaskExtensions.WaitAndGetResult_CanCallOnBackground[T](Task`1 task, CancellationToken cancellationToken)880   at Microsoft.CodeAnalysis.Editor.Implementation.Formatting.FormatCommandHandler.ExecuteReturnOrTypeCommand(EditorCommandArgs args, Action nextHandler, CancellationToken cancellationToken)881   at Microsoft.CodeAnalysis.Editor.Implementation.Formatting.FormatCommandHandler.ExecuteCommand(ReturnKeyCommandArgs args, Action nextHandler, CommandExecutionContext context)882   at Microsoft.VisualStudio.Commanding.CommandHandlerExtensions.ExecuteCommand[T](ICommandHandler commandHandler, T args, Action nextCommandHandler, CommandExecutionContext executionContext)883   at Microsoft.VisualStudio.UI.Text.Commanding.Implementation.EditorCommandHandlerService.&lt;&gt;c__DisplayClass14_1`1.&lt;Execute&gt;b__1()884   at Microsoft.VisualStudio.Text.Utilities.GuardedOperations.CallExtensionPoint(Object errorSource, Action call)885--- End of stack trace from previous location where exception was thrown ---886   at Microsoft.VisualStudio.Telemetry.WindowsErrorReporting.WatsonReport.GetClrWatsonExceptionInfo(Exception exceptionObject)887```888 889My guess is that JS/TS formatting was too slow and either the user or a timeout attempted to cancel the operation.  Perhaps OperationCanceledException is not supposed to bubble out of a command handler?",1,operationcanceledexception during formatting   a customer found this in their activity log after editing js ts in a session with responsiveness issues          system operationcanceledexception  the operation was canceled      at system threading cancellationtoken throwoperationcanceledexception       at system threading tasks task wait   millisecondstimeout  cancellationtoken cancellationtoken      at roslyn utilities taskextensions waitandgetresult cancallonbackground  task   task  cancellationtoken cancellationtoken      at microsoft codeanalysis editor implementation formatting formatcommandhandler executereturnortypecommand editorcommandargs args  action nexthandler  cancellationtoken cancellationtoken      at microsoft codeanalysis editor implementation formatting formatcommandhandler executecommand returnkeycommandargs args  action nexthandler  commandexecutioncontext context      at microsoft visualstudio commanding commandhandlerextensions executecommand  icommandhandler commandhandler  t args  action nextcommandhandler  commandexecutioncontext executioncontext      at microsoft visualstudio ui text commanding implementation editorcommandhandlerservice  lt  gt c         lt execute gt b          at microsoft visualstudio text utilities guardedoperations callextensionpoint object errorsource  action call       end of stack trace from previous location where exception was thrown         at microsoft visualstudio telemetry windowserrorreporting watsonreport getclrwatsonexceptioninfo exception exceptionobject          my guess is that js ts formatting was too slow and either the user or a timeout attempted to cancel the operation   perhaps operationcanceledexception is not supposed to bubble out of a command handler ,189068960,9222556375.0,IssuesEvent,2019-03-11 23:22:16,adobe/spectrum-css,https://api.github.com/repos/adobe/spectrum-css,opened,Show Markup broken for some examples,documentation,"### Expected Behavior891 892Show Markup does what it promises to do, all of the time893 894### Actual Behavior895 896Broken promises, broken hearts\897 898#### Steps to Reproduce899 9001. http://opensource.adobe.com/spectrum-css/2.8.0/docs/#toast9012. Click ""Show Markup""9023. Cry903 904#### Spectrum-CSS version905 9062.8.0907",1.0,"Show Markup broken for some examples - ### Expected Behavior908 909Show Markup does what it promises to do, all of the time910 911### Actual Behavior912 913Broken promises, broken hearts\914 915#### Steps to Reproduce916 9171. http://opensource.adobe.com/spectrum-css/2.8.0/docs/#toast9182. Click ""Show Markup""9193. Cry920 921#### Spectrum-CSS version922 9232.8.0924",0,show markup broken for some examples       expected behavior    show markup does what it promises to do  all of the time        actual behavior    broken promises  broken hearts          steps to reproduce             click  show markup      cry         spectrum css version           ,092522298,7153737033.0,IssuesEvent,2018-01-26 03:39:46,apache/incubator-pulsar,https://api.github.com/repos/apache/incubator-pulsar,opened,Add  pulsar-prometheus docker image to pulsar repo,component/build,"#### Expected behavior926 927We have added [pulsar-prometheus](https://github.com/apache/incubator-pulsar/blob/master/deployment/dcos/PulsarGroups.json#L251) docker image in #950 which is not present into pulsar repo. It would be great if we can add it to pulsar repo for any future changes or enhancement.928",1.0,"Add  pulsar-prometheus docker image to pulsar repo - #### Expected behavior929 930We have added [pulsar-prometheus](https://github.com/apache/incubator-pulsar/blob/master/deployment/dcos/PulsarGroups.json#L251) docker image in #950 which is not present into pulsar repo. It would be great if we can add it to pulsar repo for any future changes or enhancement.931",0,add  pulsar prometheus docker image to pulsar repo        expected behavior    we have added     docker image in    which is not present into pulsar repo  it would be great if we can add it to pulsar repo for any future changes or enhancement   ,09321071,12798704085.0,IssuesEvent,2020-07-02 14:19:16,dotnet/roslyn,https://api.github.com/repos/dotnet/roslyn,closed,VS crashes with possibly invalid [MemberNotNull] annotation,Area-Compilers New Language Feature - Nullable Reference Types Tenet-Reliability,"**Version Used**: 933 934```935Microsoft Visual Studio Professional 2019 Preview936Version 16.6.0 Preview 6.0937VisualStudio.16.Preview/16.6.0-pre.6.0+30105.148938Microsoft .NET Framework939Version 4.8.03752940```941 942**Steps to Reproduce**:943 944Paste the following code into VS.945```946using System.Diagnostics.CodeAnalysis;947 948class C949{950  public string? field;951  952  [MemberNotNull(""field"")]953  public static void M()954  {955  }956  957  public void Test()958  {959    M();960    field.ToString();961  }962}963 964namespace System.Diagnostics.CodeAnalysis965{966  [AttributeUsage(AttributeTargets.Method | AttributeTargets.Property, AllowMultiple = true)]967  public sealed class MemberNotNullAttribute : Attribute968  {969      public MemberNotNullAttribute(params string[] members) { }970      public MemberNotNullAttribute(string member) { }971  }972}973 974```975 976**Expected Behavior**:977No crash. Probably some warnings978 979**Actual Behavior**:980VS crashes981 982**Notes**983The following test currently crashes in Roslyn's master branch with a `NullReferenceException`984 985```986commit 27654b066e600a350706a13ebd67d1da542c1a7b987Merge: 436d17816f6 0c9f90368a5988Author: msftbot[bot] <48340428+msftbot[bot]@users.noreply.github.com>989Date:   Thu May 7 05:33:48 2020 +0000990 991    Merge pull request #44029 from dotnet/merges/release/dev16.7-preview1-to-master992 993    Merge release/dev16.7-preview1 to master994```995 996```997        [Fact]998        public void Test()999        {1000            var source = @""using System.Diagnostics.CodeAnalysis;1001 1002class C1003{1004  public string? field;1005  1006  [MemberNotNull(""""field"""")]1007  public static void M()1008  {1009  }1010  1011  public void Test()1012  {1013    M();1014    field.ToString();1015  }1016}"";1017            var comp = CreateCompilation(1018                new[]1019                {1020                    source, MemberNotNullAttributeDefinition1021                },1022                options: WithNonNullTypesTrue(),1023                targetFramework: TargetFramework.NetCoreApp30,1024                parseOptions: TestOptions.RegularPreview);1025            comp.VerifyDiagnostics();1026        }1027```1028 1029```1030System.NullReferenceException: Object reference not set to an instance of an object.1031 1032System.NullReferenceException1033Object reference not set to an instance of an object.1034   at Microsoft.CodeAnalysis.CSharp.LocalDataFlowPass`2.GetOrCreateSlot(Symbol symbol, Int32 containingSlot, Boolean forceSlotEvenIfEmpty) in C:\Work\roslyn\src\Compilers\CSharp\Portable\FlowAnalysis\LocalDataFlowPass.cs:line 1231035   at Microsoft.CodeAnalysis.CSharp.NullableWalker.GetOrCreateSlot(Symbol symbol, Int32 containingSlot, Boolean forceSlotEvenIfEmpty) in C:\Work\roslyn\src\Compilers\CSharp\Portable\FlowAnalysis\NullableWalker.cs:line 12751036   at Microsoft.CodeAnalysis.CSharp.NullableWalker.<Scan>g__getSlotForFieldOrProperty|44_13(Symbol member) in C:\Work\roslyn\src\Compilers\CSharp\Portable\FlowAnalysis\NullableWalker.cs:line 7181037   at Microsoft.CodeAnalysis.CSharp.NullableWalker.<Scan>g__makeMemberMaybeNull|44_7(MethodSymbol method, String memberName) in C:\Work\roslyn\src\Compilers\CSharp\Portable\FlowAnalysis\NullableWalker.cs:line 5941038   at Microsoft.CodeAnalysis.CSharp.NullableWalker.<Scan>g__makeMembersMaybeNull|44_6(MethodSymbol method, ImmutableArray`1 members) in C:\Work\roslyn\src\Compilers\CSharp\Portable\FlowAnalysis\NullableWalker.cs:line 5851039   at Microsoft.CodeAnalysis.CSharp.NullableWalker.<Scan>g__makeNotNullMembersMaybeNull|44_5() in C:\Work\roslyn\src\Compilers\CSharp\Portable\FlowAnalysis\NullableWalker.cs:line 5721040   at Microsoft.CodeAnalysis.CSharp.NullableWalker.Scan(Boolean& badRegion) in C:\Work\roslyn\src\Compilers\CSharp\Portable\FlowAnalysis\NullableWalker.cs:line 4361041   at Microsoft.CodeAnalysis.CSharp.AbstractFlowPass`2.Analyze(Boolean& badRegion, Optional`1 initialState) in C:\Work\roslyn\src\Compilers\CSharp\Portable\FlowAnalysis\AbstractFlowPass.cs:line 4351042   at Microsoft.CodeAnalysis.CSharp.NullableWalker.Analyze(NullableWalker walker, Symbol symbol, DiagnosticBag diagnostics, VariableState initialState, Builder snapshotBuilderOpt) in C:\Work\roslyn\src\Compilers\CSharp\Portable\FlowAnalysis\NullableWalker.cs:line 9711043   at Microsoft.CodeAnalysis.CSharp.NullableWalker.Analyze(CSharpCompilation compilation, Symbol symbol, BoundNode node, Binder binder, Conversions conversions, DiagnosticBag diagnostics, Boolean useMethodSignatureParameterTypes, MethodSymbol delegateInvokeMethodOpt, VariableState initialState, Builder analyzedNullabilityMapOpt, Builder snapshotBuilderOpt, ArrayBuilder`1 returnTypesOpt) in C:\Work\roslyn\src\Compilers\CSharp\Portable\FlowAnalysis\NullableWalker.cs:line 9511044   at Microsoft.CodeAnalysis.CSharp.NullableWalker.AnalyzeAndRewrite(CSharpCompilation compilation, Symbol symbol, BoundNode node, Binder binder, DiagnosticBag diagnostics, Boolean createSnapshots, SnapshotManager& snapshotManager, ImmutableDictionary`2& remappedSymbols) in C:\Work\roslyn\src\Compilers\CSharp\Portable\FlowAnalysis\NullableWalker.cs:line 7881045   at Microsoft.CodeAnalysis.CSharp.MethodCompiler.BindMethodBody(MethodSymbol method, TypeCompilationState compilationState, DiagnosticBag diagnostics, ImportChain& importChain, Boolean& originalBodyNested, InitialState& forSemanticModel) in C:\Work\roslyn\src\Compilers\CSharp\Portable\Compiler\MethodCompiler.cs:line 16821046   at Microsoft.CodeAnalysis.CSharp.MethodCompiler.CompileMethod(MethodSymbol methodSymbol, Int32 methodOrdinal, ProcessedFieldInitializers& processedInitializers, SynthesizedSubmissionFields previousSubmissionFields, TypeCompilationState compilationState) in C:\Work\roslyn\src\Compilers\CSharp\Portable\Compiler\MethodCompiler.cs:line 9861047   at Microsoft.CodeAnalysis.CSharp.MethodCompiler.CompileNamedType(NamedTypeSymbol containingType) in C:\Work\roslyn\src\Compilers\CSharp\Portable\Compiler\MethodCompiler.cs:line 5111048   at Microsoft.CodeAnalysis.CSharp.MethodCompiler.<>c__DisplayClass22_0.<CompileNamedTypeAsync>b__0() in C:\Work\roslyn\src\Compilers\CSharp\Portable\Compiler\MethodCompiler.cs:line 4011049   at Roslyn.Utilities.UICultureUtilities.<>c__DisplayClass5_0.<WithCurrentUICulture>b__0() in C:\Work\roslyn\src\Compilers\Core\Portable\InternalUtilities\UICultureUtilities.cs:line 1411050   at System.Threading.Tasks.Task.InnerInvoke()1051   at System.Threading.Tasks.Task.Execute()1052--- End of stack trace from previous location where exception was thrown ---1053   at System.Runtime.CompilerServices.TaskAwaiter.ThrowForNonSuccess(Task task)1054   at System.Runtime.CompilerServices.TaskAwaiter.HandleNonSuccessAndDebuggerNotification(Task task)1055   at System.Runtime.CompilerServices.TaskAwaiter.GetResult()1056   at Microsoft.CodeAnalysis.CSharp.MethodCompiler.WaitForWorkers() in C:\Work\roslyn\src\Compilers\CSharp\Portable\Compiler\MethodCompiler.cs:line 3161057   at Microsoft.CodeAnalysis.CSharp.MethodCompiler.CompileMethodBodies(CSharpCompilation compilation, PEModuleBuilder moduleBeingBuiltOpt, Boolean emittingPdb, Boolean emitTestCoverageData, Boolean hasDeclarationErrors, DiagnosticBag diagnostics, Predicate`1 filterOpt, CancellationToken cancellationToken) in C:\Work\roslyn\src\Compilers\CSharp\Portable\Compiler\MethodCompiler.cs:line 1551058   at Microsoft.CodeAnalysis.CSharp.CSharpCompilation.GetDiagnosticsForAllMethodBodies(DiagnosticBag diagnostics, CancellationToken cancellationToken) in C:\Work\roslyn\src\Compilers\CSharp\Portable\Compilation\CSharpCompilation.cs:line 24481059   at Microsoft.CodeAnalysis.CSharp.CSharpCompilation.GetDiagnostics(CompilationStage stage, Boolean includeEarlierStages, DiagnosticBag diagnostics, CancellationToken cancellationToken) in C:\Work\roslyn\src\Compilers\CSharp\Portable\Compilation\CSharpCompilation.cs:line 24171060   at Microsoft.CodeAnalysis.CSharp.CSharpCompilation.GetDiagnostics(CompilationStage stage, Boolean includeEarlierStages, CancellationToken cancellationToken) in C:\Work\roslyn\src\Compilers\CSharp\Portable\Compilation\CSharpCompilation.cs:line 23251061   at Microsoft.CodeAnalysis.CSharp.CSharpCompilation.GetDiagnostics(CancellationToken cancellationToken) in C:\Work\roslyn\src\Compilers\CSharp\Portable\Compilation\CSharpCompilation.cs:line 23191062   at Microsoft.CodeAnalysis.DiagnosticExtensions.VerifyDiagnostics[TCompilation](TCompilation c, DiagnosticDescription[] expected) in C:\Work\roslyn\src\Test\Utilities\Portable\Diagnostics\DiagnosticExtensions.cs:line 4131063   at 1064```",True,"VS crashes with possibly invalid [MemberNotNull] annotation - **Version Used**: 1065 1066```1067Microsoft Visual Studio Professional 2019 Preview1068Version 16.6.0 Preview 6.01069VisualStudio.16.Preview/16.6.0-pre.6.0+30105.1481070Microsoft .NET Framework1071Version 4.8.037521072```1073 1074**Steps to Reproduce**:1075 1076Paste the following code into VS.1077```1078using System.Diagnostics.CodeAnalysis;1079 1080class C1081{1082  public string? field;1083  1084  [MemberNotNull(""field"")]1085  public static void M()1086  {1087  }1088  1089  public void Test()1090  {1091    M();1092    field.ToString();1093  }1094}1095 1096namespace System.Diagnostics.CodeAnalysis1097{1098  [AttributeUsage(AttributeTargets.Method | AttributeTargets.Property, AllowMultiple = true)]1099  public sealed class MemberNotNullAttribute : Attribute1100  {1101      public MemberNotNullAttribute(params string[] members) { }1102      public MemberNotNullAttribute(string member) { }1103  }1104}1105 1106```1107 1108**Expected Behavior**:1109No crash. Probably some warnings1110 1111**Actual Behavior**:1112VS crashes1113 1114**Notes**1115The following test currently crashes in Roslyn's master branch with a `NullReferenceException`1116 1117```1118commit 27654b066e600a350706a13ebd67d1da542c1a7b1119Merge: 436d17816f6 0c9f90368a51120Author: msftbot[bot] <48340428+msftbot[bot]@users.noreply.github.com>1121Date:   Thu May 7 05:33:48 2020 +00001122 1123    Merge pull request #44029 from dotnet/merges/release/dev16.7-preview1-to-master1124 1125    Merge release/dev16.7-preview1 to master1126```1127 1128```1129        [Fact]1130        public void Test()1131        {1132            var source = @""using System.Diagnostics.CodeAnalysis;1133 1134class C1135{1136  public string? field;1137  1138  [MemberNotNull(""""field"""")]1139  public static void M()1140  {1141  }1142  1143  public void Test()1144  {1145    M();1146    field.ToString();1147  }1148}"";1149            var comp = CreateCompilation(1150                new[]1151                {1152                    source, MemberNotNullAttributeDefinition1153                },1154                options: WithNonNullTypesTrue(),1155                targetFramework: TargetFramework.NetCoreApp30,1156                parseOptions: TestOptions.RegularPreview);1157            comp.VerifyDiagnostics();1158        }1159```1160 1161```1162System.NullReferenceException: Object reference not set to an instance of an object.1163 1164System.NullReferenceException1165Object reference not set to an instance of an object.1166   at Microsoft.CodeAnalysis.CSharp.LocalDataFlowPass`2.GetOrCreateSlot(Symbol symbol, Int32 containingSlot, Boolean forceSlotEvenIfEmpty) in C:\Work\roslyn\src\Compilers\CSharp\Portable\FlowAnalysis\LocalDataFlowPass.cs:line 1231167   at Microsoft.CodeAnalysis.CSharp.NullableWalker.GetOrCreateSlot(Symbol symbol, Int32 containingSlot, Boolean forceSlotEvenIfEmpty) in C:\Work\roslyn\src\Compilers\CSharp\Portable\FlowAnalysis\NullableWalker.cs:line 12751168   at Microsoft.CodeAnalysis.CSharp.NullableWalker.<Scan>g__getSlotForFieldOrProperty|44_13(Symbol member) in C:\Work\roslyn\src\Compilers\CSharp\Portable\FlowAnalysis\NullableWalker.cs:line 7181169   at Microsoft.CodeAnalysis.CSharp.NullableWalker.<Scan>g__makeMemberMaybeNull|44_7(MethodSymbol method, String memberName) in C:\Work\roslyn\src\Compilers\CSharp\Portable\FlowAnalysis\NullableWalker.cs:line 5941170   at Microsoft.CodeAnalysis.CSharp.NullableWalker.<Scan>g__makeMembersMaybeNull|44_6(MethodSymbol method, ImmutableArray`1 members) in C:\Work\roslyn\src\Compilers\CSharp\Portable\FlowAnalysis\NullableWalker.cs:line 5851171   at Microsoft.CodeAnalysis.CSharp.NullableWalker.<Scan>g__makeNotNullMembersMaybeNull|44_5() in C:\Work\roslyn\src\Compilers\CSharp\Portable\FlowAnalysis\NullableWalker.cs:line 5721172   at Microsoft.CodeAnalysis.CSharp.NullableWalker.Scan(Boolean& badRegion) in C:\Work\roslyn\src\Compilers\CSharp\Portable\FlowAnalysis\NullableWalker.cs:line 4361173   at Microsoft.CodeAnalysis.CSharp.AbstractFlowPass`2.Analyze(Boolean& badRegion, Optional`1 initialState) in C:\Work\roslyn\src\Compilers\CSharp\Portable\FlowAnalysis\AbstractFlowPass.cs:line 4351174   at Microsoft.CodeAnalysis.CSharp.NullableWalker.Analyze(NullableWalker walker, Symbol symbol, DiagnosticBag diagnostics, VariableState initialState, Builder snapshotBuilderOpt) in C:\Work\roslyn\src\Compilers\CSharp\Portable\FlowAnalysis\NullableWalker.cs:line 9711175   at Microsoft.CodeAnalysis.CSharp.NullableWalker.Analyze(CSharpCompilation compilation, Symbol symbol, BoundNode node, Binder binder, Conversions conversions, DiagnosticBag diagnostics, Boolean useMethodSignatureParameterTypes, MethodSymbol delegateInvokeMethodOpt, VariableState initialState, Builder analyzedNullabilityMapOpt, Builder snapshotBuilderOpt, ArrayBuilder`1 returnTypesOpt) in C:\Work\roslyn\src\Compilers\CSharp\Portable\FlowAnalysis\NullableWalker.cs:line 9511176   at Microsoft.CodeAnalysis.CSharp.NullableWalker.AnalyzeAndRewrite(CSharpCompilation compilation, Symbol symbol, BoundNode node, Binder binder, DiagnosticBag diagnostics, Boolean createSnapshots, SnapshotManager& snapshotManager, ImmutableDictionary`2& remappedSymbols) in C:\Work\roslyn\src\Compilers\CSharp\Portable\FlowAnalysis\NullableWalker.cs:line 7881177   at Microsoft.CodeAnalysis.CSharp.MethodCompiler.BindMethodBody(MethodSymbol method, TypeCompilationState compilationState, DiagnosticBag diagnostics, ImportChain& importChain, Boolean& originalBodyNested, InitialState& forSemanticModel) in C:\Work\roslyn\src\Compilers\CSharp\Portable\Compiler\MethodCompiler.cs:line 16821178   at Microsoft.CodeAnalysis.CSharp.MethodCompiler.CompileMethod(MethodSymbol methodSymbol, Int32 methodOrdinal, ProcessedFieldInitializers& processedInitializers, SynthesizedSubmissionFields previousSubmissionFields, TypeCompilationState compilationState) in C:\Work\roslyn\src\Compilers\CSharp\Portable\Compiler\MethodCompiler.cs:line 9861179   at Microsoft.CodeAnalysis.CSharp.MethodCompiler.CompileNamedType(NamedTypeSymbol containingType) in C:\Work\roslyn\src\Compilers\CSharp\Portable\Compiler\MethodCompiler.cs:line 5111180   at Microsoft.CodeAnalysis.CSharp.MethodCompiler.<>c__DisplayClass22_0.<CompileNamedTypeAsync>b__0() in C:\Work\roslyn\src\Compilers\CSharp\Portable\Compiler\MethodCompiler.cs:line 4011181   at Roslyn.Utilities.UICultureUtilities.<>c__DisplayClass5_0.<WithCurrentUICulture>b__0() in C:\Work\roslyn\src\Compilers\Core\Portable\InternalUtilities\UICultureUtilities.cs:line 1411182   at System.Threading.Tasks.Task.InnerInvoke()1183   at System.Threading.Tasks.Task.Execute()1184--- End of stack trace from previous location where exception was thrown ---1185   at System.Runtime.CompilerServices.TaskAwaiter.ThrowForNonSuccess(Task task)1186   at System.Runtime.CompilerServices.TaskAwaiter.HandleNonSuccessAndDebuggerNotification(Task task)1187   at System.Runtime.CompilerServices.TaskAwaiter.GetResult()1188   at Microsoft.CodeAnalysis.CSharp.MethodCompiler.WaitForWorkers() in C:\Work\roslyn\src\Compilers\CSharp\Portable\Compiler\MethodCompiler.cs:line 3161189   at Microsoft.CodeAnalysis.CSharp.MethodCompiler.CompileMethodBodies(CSharpCompilation compilation, PEModuleBuilder moduleBeingBuiltOpt, Boolean emittingPdb, Boolean emitTestCoverageData, Boolean hasDeclarationErrors, DiagnosticBag diagnostics, Predicate`1 filterOpt, CancellationToken cancellationToken) in C:\Work\roslyn\src\Compilers\CSharp\Portable\Compiler\MethodCompiler.cs:line 1551190   at Microsoft.CodeAnalysis.CSharp.CSharpCompilation.GetDiagnosticsForAllMethodBodies(DiagnosticBag diagnostics, CancellationToken cancellationToken) in C:\Work\roslyn\src\Compilers\CSharp\Portable\Compilation\CSharpCompilation.cs:line 24481191   at Microsoft.CodeAnalysis.CSharp.CSharpCompilation.GetDiagnostics(CompilationStage stage, Boolean includeEarlierStages, DiagnosticBag diagnostics, CancellationToken cancellationToken) in C:\Work\roslyn\src\Compilers\CSharp\Portable\Compilation\CSharpCompilation.cs:line 24171192   at Microsoft.CodeAnalysis.CSharp.CSharpCompilation.GetDiagnostics(CompilationStage stage, Boolean includeEarlierStages, CancellationToken cancellationToken) in C:\Work\roslyn\src\Compilers\CSharp\Portable\Compilation\CSharpCompilation.cs:line 23251193   at Microsoft.CodeAnalysis.CSharp.CSharpCompilation.GetDiagnostics(CancellationToken cancellationToken) in C:\Work\roslyn\src\Compilers\CSharp\Portable\Compilation\CSharpCompilation.cs:line 23191194   at Microsoft.CodeAnalysis.DiagnosticExtensions.VerifyDiagnostics[TCompilation](TCompilation c, DiagnosticDescription[] expected) in C:\Work\roslyn\src\Test\Utilities\Portable\Diagnostics\DiagnosticExtensions.cs:line 4131195   at 1196```",1,vs crashes with possibly invalid   annotation     version used             microsoft visual studio professional   preview  version       preview      visualstudio   preview       pre          microsoft  net framework  version                 steps to reproduce       paste the following code into vs        using system diagnostics codeanalysis     class c       public string  field              public static void m                    public void test             m         field tostring               namespace system diagnostics codeanalysis            public sealed class membernotnullattribute   attribute             public membernotnullattribute params string  members             public membernotnullattribute string member                          expected behavior     no crash  probably some warnings      actual behavior     vs crashes      notes    the following test currently crashes in roslyn s master branch with a  nullreferenceexception          commit    merge       author  msftbot     date    thu may                     merge pull request    from dotnet merges release       to master        merge release       to master                                 public void test                           var source     using system diagnostics codeanalysis     class c       public string  field              public static void m                    public void test             m         field tostring                           var comp   createcompilation                   new                                          source  membernotnullattributedefinition                                      options  withnonnulltypestrue                     targetframework  targetframework                     parseoptions  testoptions regularpreview                comp verifydiagnostics                            system nullreferenceexception  object reference not set to an instance of an object     system nullreferenceexception  object reference not set to an instance of an object      at microsoft codeanalysis csharp localdataflowpass   getorcreateslot symbol symbol    containingslot  boolean forceslotevenifempty  in c  work roslyn src compilers csharp portable flowanalysis localdataflowpass cs line       at microsoft codeanalysis csharp nullablewalker getorcreateslot symbol symbol    containingslot  boolean forceslotevenifempty  in c  work roslyn src compilers csharp portable flowanalysis nullablewalker cs line       at microsoft codeanalysis csharp nullablewalker  g  getslotforfieldorproperty     symbol member  in c  work roslyn src compilers csharp portable flowanalysis nullablewalker cs line       at microsoft codeanalysis csharp nullablewalker  g  makemembermaybenull     methodsymbol method  string membername  in c  work roslyn src compilers csharp portable flowanalysis nullablewalker cs line       at microsoft codeanalysis csharp nullablewalker  g  makemembersmaybenull     methodsymbol method  immutablearray   members  in c  work roslyn src compilers csharp portable flowanalysis nullablewalker cs line       at microsoft codeanalysis csharp nullablewalker  g  makenotnullmembersmaybenull       in c  work roslyn src compilers csharp portable flowanalysis nullablewalker cs line       at microsoft codeanalysis csharp nullablewalker scan boolean  badregion  in c  work roslyn src compilers csharp portable flowanalysis nullablewalker cs line       at microsoft codeanalysis csharp abstractflowpass   analyze boolean  badregion  optional   initialstate  in c  work roslyn src compilers csharp portable flowanalysis abstractflowpass cs line       at microsoft codeanalysis csharp nullablewalker analyze nullablewalker walker  symbol symbol  diagnosticbag diagnostics  variablestate initialstate  builder snapshotbuilderopt  in c  work roslyn src compilers csharp portable flowanalysis nullablewalker cs line       at microsoft codeanalysis csharp nullablewalker analyze csharpcompilation compilation  symbol symbol  boundnode node  binder binder  conversions conversions  diagnosticbag diagnostics  boolean usemethodsignatureparametertypes  methodsymbol delegateinvokemethodopt  variablestate initialstate  builder analyzednullabilitymapopt  builder snapshotbuilderopt  arraybuilder   returntypesopt  in c  work roslyn src compilers csharp portable flowanalysis nullablewalker cs line       at microsoft codeanalysis csharp nullablewalker analyzeandrewrite csharpcompilation compilation  symbol symbol  boundnode node  binder binder  diagnosticbag diagnostics  boolean createsnapshots  snapshotmanager  snapshotmanager  immutabledictionary    remappedsymbols  in c  work roslyn src compilers csharp portable flowanalysis nullablewalker cs line       at microsoft codeanalysis csharp methodcompiler bindmethodbody methodsymbol method  typecompilationstate compilationstate  diagnosticbag diagnostics  importchain  importchain  boolean  originalbodynested  initialstate  forsemanticmodel  in c  work roslyn src compilers csharp portable compiler methodcompiler cs line       at microsoft codeanalysis csharp methodcompiler compilemethod methodsymbol methodsymbol    methodordinal  processedfieldinitializers  processedinitializers  synthesizedsubmissionfields previoussubmissionfields  typecompilationstate compilationstate  in c  work roslyn src compilers csharp portable compiler methodcompiler cs line       at microsoft codeanalysis csharp methodcompiler compilenamedtype namedtypesymbol containingtype  in c  work roslyn src compilers csharp portable compiler methodcompiler cs line       at microsoft codeanalysis csharp methodcompiler  c       b      in c  work roslyn src compilers csharp portable compiler methodcompiler cs line       at roslyn utilities uicultureutilities  c       b      in c  work roslyn src compilers core portable internalutilities uicultureutilities cs line       at system threading tasks task innerinvoke       at system threading tasks task execute        end of stack trace from previous location where exception was thrown         at system runtime compilerservices taskawaiter throwfornonsuccess task task      at system runtime compilerservices taskawaiter handlenonsuccessanddebuggernotification task task      at system runtime compilerservices taskawaiter getresult       at microsoft codeanalysis csharp methodcompiler waitforworkers   in c  work roslyn src compilers csharp portable compiler methodcompiler cs line       at microsoft codeanalysis csharp methodcompiler compilemethodbodies csharpcompilation compilation  pemodulebuilder modulebeingbuiltopt  boolean emittingpdb  boolean emittestcoveragedata  boolean hasdeclarationerrors  diagnosticbag diagnostics  predicate   filteropt  cancellationtoken cancellationtoken  in c  work roslyn src compilers csharp portable compiler methodcompiler cs line       at microsoft codeanalysis csharp csharpcompilation getdiagnosticsforallmethodbodies diagnosticbag diagnostics  cancellationtoken cancellationtoken  in c  work roslyn src compilers csharp portable compilation csharpcompilation cs line       at microsoft codeanalysis csharp csharpcompilation getdiagnostics compilationstage stage  boolean includeearlierstages  diagnosticbag diagnostics  cancellationtoken cancellationtoken  in c  work roslyn src compilers csharp portable compilation csharpcompilation cs line       at microsoft codeanalysis csharp csharpcompilation getdiagnostics compilationstage stage  boolean includeearlierstages  cancellationtoken cancellationtoken  in c  work roslyn src compilers csharp portable compilation csharpcompilation cs line       at microsoft codeanalysis csharp csharpcompilation getdiagnostics cancellationtoken cancellationtoken  in c  work roslyn src compilers csharp portable compilation csharpcompilation cs line       at microsoft codeanalysis diagnosticextensions verifydiagnostics  tcompilation c  diagnosticdescription  expected  in c  work roslyn src test utilities portable diagnostics diagnosticextensions cs line       at      ,11197188,4020461574.0,IssuesEvent,2016-05-16 18:30:03,wordpress-mobile/WordPress-iOS,https://api.github.com/repos/wordpress-mobile/WordPress-iOS,closed,People Management: Delete Users,People Management [Type] Enhancement,"#### Details:1198Admins should be allowed to Delete Users. Let's replicate Calypso's UX:1199 1200- On delete, Posts should be reassigned to another user (to be picked).

Showing the first 1,200 of 22920 lines. Download the file for the rest.